program: Orca
programVersion: 5.0.2
elementType: O O O O N C C C C C C C C C C C C C C C C C C C H H H H H H H H H H H H H H H H H H H H H H H H H
charge: 0
multiplicity: 1
keywords: wb97x-d3
keywords: def2-TZVPP
keywords: def2/J RIJCOSX
keywords: DEFGRID2
keywords: scfconv7
keywords: smallprint printgap noloewdin
keywords: NOSOSCF
formula: C19H25NO4
InChI: InChI=1/C19H25NO4/c1-11(2)9-14-15(19(14,3)4)18(23)24-10-20-16(21)12-7-5-6-8-13(12)17(20)22/h9,14-15H,5-8,10H2,1-4H3
49 atoms
O  1.271793 -1.291405 -0.274064
O  2.422923 -1.837409 -2.110026
O  -1.248191 -0.327526 -2.417748
O  -1.328592 -1.869724 1.852304
N  -1.029822 -1.38716 -0.382406
C  3.902201 -0.217446 0.819566
C  3.137438 0.935822 0.267648
C  3.37949 -0.295485 -0.607553
C  5.402372 -0.06853 0.924725
C  3.331624 -1.081152 1.918753
C  1.803058 1.34244 0.774951
C  2.329665 -1.212213 -1.078894
C  0.946211 2.129419 0.120216
C  0.167115 -2.11227 -0.632275
C  -0.349499 2.557052 0.738596
C  1.179917 2.627573 -1.272515
C  -2.774309 0.101616 -0.586581
C  -2.79152 -0.343369 0.670516
C  -3.73565 1.072343 -1.162546
C  -3.761893 0.07704 1.710308
C  -4.934491 1.218499 -0.224487
C  -4.504394 1.328429 1.23755
C  -1.624127 -0.51733 -1.289593
C  -1.661631 -1.288672 0.851827
H  3.75376 1.769122 -0.060726
H  4.140203 -0.168591 -1.369378
H  5.676767 0.391999 1.876161
H  5.897859 -1.040288 0.872145
H  5.808467 0.554574 0.126794
H  3.652528 -0.691541 2.887106
H  2.246789 -1.133598 1.937389
H  3.710634 -2.10186 1.838852
H  1.530779 1.004856 1.770607
H  0.183281 -3.010166 -0.016457
H  0.202585 -2.401526 -1.680416
H  -1.194505 2.316188 0.089387
H  -0.521085 2.089291 1.70835
H  -0.374612 3.641202 0.88005
H  0.99644 3.702743 -1.341736
H  2.187484 2.434696 -1.63754
H  0.481717 2.151631 -1.967446
H  -3.232444 2.03527 -1.302962
H  -4.0528 0.751945 -2.157806
H  -4.462587 -0.741261 1.9051
H  -3.247551 0.262519 2.65641
H  -5.517999 2.094587 -0.510524
H  -5.591843 0.352544 -0.344112
H  -5.374758 1.498539 1.872857
H  -3.853146 2.199297 1.359188
elementType: O N C H
totalener: -1094.87330038 hartree
nucrepener: 2222.13665526 hartree
electener: -3317.00995565 hartree
oneelecener: -5906.11835249 hartree
twoeener: 2589.10839684 hartree
cpcmener: -0.03215334 hartree
kineticenergy: 1090.05107224 hartree
xcener: -105.975386094750 hartree
chargesum: -0.0000000
charge: -0.256697 -0.464206 -0.408346 -0.411793 -0.079623 0.141308 -0.032563 -0.160372 -0.266141 -0.286534 -0.233561 0.430468 -0.026632 0.065317 -0.243343 -0.264889 -0.075066 -0.058407 -0.072565 -0.073048 -0.128546 -0.142013 0.287640 0.311309 0.112063 0.091931 0.093323 0.096173 0.086644 0.098156 0.082813 0.103810 0.121738 0.132769 0.132559 0.075713 0.094476 0.113830 0.102399 0.092471 0.095249 0.101746 0.100895 0.103869 0.093856 0.081261 0.077993 0.083350 0.079211
qa: -0.2567 -0.4642 -0.4083 -0.4118 -0.0796 0.1413 -0.0326 -0.1604 -0.2661 -0.2865 -0.2336 0.4305 -0.0266 0.0653 -0.2433 -0.2649 -0.0751 -0.0584 -0.0726 -0.0730 -0.1285 -0.1420 0.2876 0.3113 0.1121 0.0919 0.0933 0.0962 0.0866 0.0982 0.0828 0.1038 0.1217 0.1328 0.1326 0.0757 0.0945 0.1138 0.1024 0.0925 0.0952 0.1017 0.1009 0.1039 0.0939 0.0813 0.0780 0.0834 0.0792
va: 2.0916 2.0486 2.0947 2.0985 3.1091 3.7409 3.7922 3.8678 3.9033 3.9035 3.8209 4.1306 3.6997 3.8640 3.9401 3.9437 3.6176 3.6480 3.9135 3.9159 3.9055 3.9129 4.1792 4.1873 1.0032 1.0289 1.0021 1.0015 1.0055 0.9993 1.0169 1.0004 1.0016 1.0039 1.0272 0.9919 1.0057 0.9982 0.9997 1.0064 1.0049 1.0035 1.0156 1.0045 1.0161 1.0101 1.0072 1.0106 1.0078
dispcorr: -0.028600742 hartree
energy: -1094.901901126482
dipole: 2.88099 -4.41315 -1.53216 17.57584 -16.07550 1.50034 9.11142 -7.81114 1.30028
magnitude: 2.50784 au
magnitude: 6.37442 debye
