program: Orca
programVersion: 5.0.2
elementType: O O O O N C C C C C C C C C C C C C C C C C C C H H H H H H H H H H H H H H H H H H H H H H H H H
charge: 0
multiplicity: 1
keywords: wb97x-d3
keywords: def2-TZVPP
keywords: def2/J RIJCOSX
keywords: DEFGRID2
keywords: scfconv7
keywords: smallprint printgap noloewdin
keywords: NOSOSCF
formula: C19H25NO4
InChI: InChI=1/C19H25NO4/c1-11(2)9-14-15(19(14,3)4)18(23)24-10-20-16(21)12-7-5-6-8-13(12)17(20)22/h9,14-15H,5-8,10H2,1-4H3
49 atoms
O  0.507674 -0.277819 -0.655911
O  1.524126 1.718376 -0.589298
O  -1.623999 1.244601 1.191561
O  -2.571968 -1.816393 -2.026783
N  -1.803907 -0.148894 -0.630316
C  3.400235 0.444103 1.528016
C  4.015881 0.09961 0.217888
C  2.531144 -0.190356 0.454277
C  3.707538 -0.460239 2.699033
C  3.215189 1.884673 1.937454
C  4.478082 1.133383 -0.742166
C  1.506325 0.549185 -0.296551
C  4.452883 1.01041 -2.071155
C  -0.626733 0.260074 -1.321162
C  4.967292 2.09597 -2.965464
C  3.884246 -0.182131 -2.776535
C  -3.437018 -0.351448 0.979775
C  -3.715002 -1.246358 0.030644
C  -4.247294 -0.122926 2.20077
C  -4.877173 -2.167873 0.039129
C  -5.61732 -0.782767 2.033016
C  -5.509126 -2.18439 1.432709
C  -2.20046 0.37227 0.593941
C  -2.670785 -1.160477 -1.022127
H  4.603538 -0.815461 0.212532
H  2.287738 -1.23398 0.615173
H  4.630341 -0.146741 3.191775
H  2.907373 -0.426733 3.441218
H  3.833658 -1.499481 2.39209
H  2.351296 1.989485 2.596615
H  4.093065 2.21695 2.49582
H  3.080372 2.56936 1.105228
H  4.89171 2.043475 -0.316841
H  -0.659719 -0.135577 -2.334904
H  -0.582534 1.346234 -1.368291
H  4.184344 2.446073 -3.643739
H  5.332124 2.955385 -2.40275
H  5.783444 1.734812 -3.59699
H  3.643984 -1.006903 -2.106607
H  2.969614 0.089297 -3.31354
H  4.58196 -0.55708 -3.530543
H  -3.72006 -0.537963 3.0661
H  -4.349433 0.947061 2.396549
H  -5.601907 -1.837328 -0.712245
H  -4.571065 -3.17246 -0.26263
H  -6.120973 -0.828425 2.999958
H  -6.239606 -0.157973 1.385377
H  -6.497123 -2.64455 1.378769
H  -4.906722 -2.81523 2.093012
elementType: O N C H
totalener: -1094.87590277 hartree
nucrepener: 2092.12252337 hartree
electener: -3186.99842614 hartree
oneelecener: -5646.94713186 hartree
twoeener: 2459.94870572 hartree
cpcmener: -0.03166268 hartree
kineticenergy: 1090.03730455 hartree
xcener: -105.971009269250 hartree
chargesum: 0.0000000
charge: -0.292686 -0.452968 -0.411101 -0.410672 -0.093977 0.131301 -0.014103 -0.120201 -0.264272 -0.297161 -0.271219 0.406244 -0.017895 0.077536 -0.223992 -0.267256 -0.061751 -0.081986 -0.074794 -0.068740 -0.134407 -0.135974 0.317566 0.318652 0.112422 0.095637 0.094113 0.095748 0.086341 0.100352 0.097880 0.097589 0.119358 0.123413 0.139247 0.093765 0.089055 0.095440 0.095241 0.100100 0.105168 0.101183 0.093073 0.099810 0.092895 0.080364 0.077529 0.080519 0.077611
qa: -0.2927 -0.4530 -0.4111 -0.4107 -0.0940 0.1313 -0.0141 -0.1202 -0.2643 -0.2972 -0.2712 0.4062 -0.0179 0.0775 -0.2240 -0.2673 -0.0618 -0.0820 -0.0748 -0.0687 -0.1344 -0.1360 0.3176 0.3187 0.1124 0.0956 0.0941 0.0957 0.0863 0.1004 0.0979 0.0976 0.1194 0.1234 0.1392 0.0938 0.0891 0.0954 0.0952 0.1001 0.1052 0.1012 0.0931 0.0998 0.0929 0.0804 0.0775 0.0805 0.0776
va: 2.0913 2.0385 2.1064 2.1081 3.0960 3.7367 3.8326 3.8184 3.9022 3.8961 3.8630 4.0853 3.7110 3.8597 3.9267 3.9442 3.6586 3.6972 3.9214 3.9188 3.9137 3.9171 4.2249 4.2300 1.0056 1.0304 1.0020 1.0024 1.0045 1.0016 0.9983 1.0144 1.0015 1.0134 1.0179 0.9964 1.0072 0.9968 1.0053 0.9980 0.9998 1.0045 1.0155 1.0050 1.0154 1.0097 1.0068 1.0095 1.0064
dispcorr: -0.023478073 hartree
energy: -1094.899380842101
dipole: 15.23304 -16.35059 -1.11755 0.47802 -1.74786 -1.26984 5.44881 -4.61058 0.83823
magnitude: 1.88787 au
magnitude: 4.79858 debye
