program: Orca
programVersion: 5.0.2
elementType: O O O O N C C C C C C C C C C C C C C C C C C C H H H H H H H H H H H H H H H H H H H H H H H H H
charge: 0
multiplicity: 1
keywords: wb97x-d3
keywords: def2-TZVPP
keywords: def2/J RIJCOSX
keywords: DEFGRID2
keywords: scfconv7
keywords: smallprint printgap noloewdin
keywords: NOSOSCF
formula: C19H25NO4
InChI: InChI=1/C19H25NO4/c1-11(2)9-14-15(19(14,3)4)18(23)24-10-20-16(21)12-7-5-6-8-13(12)17(20)22/h9,14-15H,5-8,10H2,1-4H3
49 atoms
O  1.279054 -1.691552 -1.183496
O  1.222086 -1.199923 0.996977
O  -1.709758 -2.29916 1.2688
O  -1.011516 -0.087793 -2.649976
N  -1.041538 -1.430939 -0.771801
C  4.055369 -0.034495 0.674658
C  3.179727 1.021537 0.089778
C  3.040809 -0.436555 -0.370024
C  5.489245 -0.059426 0.194763
C  3.920719 -0.450688 2.119524
C  2.094956 1.688875 0.845948
C  1.779738 -1.138466 -0.063939
C  1.137908 2.435117 0.29206
C  0.019257 -2.328555 -1.099405
C  0.089364 3.098587 1.131408
C  1.019154 2.670357 -1.18312
C  -2.64948 -0.257951 0.384973
C  -2.458059 0.382053 -0.767441
C  -3.6314 0.13421 1.425975
C  -3.183622 1.605107 -1.19482
C  -4.630046 1.130798 0.834754
C  -3.932543 2.203697 -0.002131
C  -1.762097 -1.451569 0.425622
C  -1.429632 -0.350092 -1.555697
H  3.654181 1.646902 -0.660651
H  3.431596 -0.648553 -1.358533
H  5.913106 -1.061333 0.28145
H  5.579082 0.248688 -0.847987
H  6.104521 0.616035 0.791772
H  2.901383 -0.431618 2.489795
H  4.295133 -1.466527 2.255304
H  4.52673 0.208265 2.744311
H  2.090427 1.565136 1.922908
H  0.017887 -3.126041 -0.354995
H  -0.137581 -2.751348 -2.089374
H  0.240528 2.918945 2.194917
H  0.075318 4.179397 0.969292
H  -0.905979 2.728839 0.868039
H  0.011227 2.439944 -1.535254
H  1.198992 3.721333 -1.425131
H  1.704914 2.065705 -1.77224
H  -4.138395 -0.749083 1.820422
H  -3.099591 0.57418 2.275923
H  -2.489423 2.330958 -1.625509
H  -3.87857 1.349589 -2.001352
H  -5.346659 0.59204 0.207847
H  -5.207617 1.596147 1.634875
H  -3.225631 2.748365 0.631021
H  -4.659241 2.937835 -0.353323
totalener: -1094.84880641 hartree
nucrepener: 2230.84352398 hartree
electener: -3325.69233040 hartree
oneelecener: -5923.82231187 hartree
twoeener: 2598.12998147 hartree
kineticenergy: 1090.10393889 hartree
xcener: -105.975564911700 hartree
chargesum: 0.0000000
charge: -0.263512 -0.378608 -0.305280 -0.315841 -0.112557 0.142819 -0.067662 -0.099998 -0.242012 -0.275439 -0.158039 0.348950 -0.029282 0.084745 -0.176799 -0.244979 -0.038759 -0.138859 -0.078204 -0.089006 -0.129356 -0.146354 0.274885 0.226648 0.090084 0.082204 0.090758 0.071479 0.088483 0.102651 0.086871 0.087834 0.088436 0.126567 0.121080 0.083724 0.090538 0.032613 0.064173 0.100447 0.090620 0.095409 0.094511 0.101844 0.101042 0.074352 0.080143 0.082462 0.084173
qa: -0.2635 -0.3786 -0.3053 -0.3158 -0.1126 0.1428 -0.0677 -0.1000 -0.2420 -0.2754 -0.1580 0.3489 -0.0293 0.0847 -0.1768 -0.2450 -0.0388 -0.1389 -0.0782 -0.0890 -0.1294 -0.1464 0.2749 0.2266 0.0901 0.0822 0.0908 0.0715 0.0885 0.1027 0.0869 0.0878 0.0884 0.1266 0.1211 0.0837 0.0905 0.0326 0.0642 0.1004 0.0906 0.0954 0.0945 0.1018 0.1010 0.0744 0.0801 0.0825 0.0842
va: 2.1258 2.1032 2.2094 2.1932 3.0764 3.7506 3.8795 3.8454 3.8993 3.9060 3.8880 4.1600 3.7446 3.9228 3.9378 3.9466 3.5701 3.6183 3.9148 3.9104 3.8905 3.8939 4.2548 4.2596 1.0048 1.0312 1.0051 1.0067 1.0046 1.0235 1.0043 0.9981 1.0153 1.0147 0.9943 1.0144 1.0011 1.0072 1.0173 0.9993 1.0114 1.0198 1.0081 1.0109 1.0099 1.0090 1.0121 1.0043 1.0134
dispcorr: -0.028045075 hartree
energy: -1094.876851486454
dipole: 6.94614 -7.34777 -0.40163 19.92496 -19.02034 0.90462 6.78061 -6.92042 -0.13981
magnitude: 0.99960 au
magnitude: 2.54078 debye
