program: Orca
programVersion: 5.0.2
elementType: O O O O N C C C C C C C C C C C C C C C C C C C H H H H H H H H H H H H H H H H H H H H H H H H H
charge: 0
multiplicity: 1
keywords: wb97x-d3
keywords: def2-TZVPP
keywords: def2/J RIJCOSX
keywords: DEFGRID2
keywords: scfconv7
keywords: smallprint printgap noloewdin
keywords: NOSOSCF
formula: C19H25NO4
InChI: InChI=1/C19H25NO4/c1-11(2)9-14-15(19(14,3)4)18(23)24-10-20-16(21)12-7-5-6-8-13(12)17(20)22/h9,14-15H,5-8,10H2,1-4H3
49 atoms
O  1.192408 -1.222026 -0.426026
O  2.691089 -2.20805 -1.750072
O  -1.364475 0.034537 -2.381142
O  -1.280616 -2.287904 1.526831
N  -1.075741 -1.400626 -0.593811
C  3.622471 -0.203537 1.152616
C  3.081691 0.889976 0.293017
C  3.41957 -0.463772 -0.328586
C  5.066658 -0.091047 1.585731
C  2.758322 -0.868838 2.196776
C  1.70557 1.424191 0.441822
C  2.425389 -1.390526 -0.908882
C  1.093283 2.213488 -0.440513
C  0.149866 -2.009612 -0.978476
C  -0.257136 2.79953 -0.159421
C  1.67371 2.574438 -1.772385
C  -2.764015 0.154306 -0.4108
C  -2.735684 -0.520708 0.738327
C  -3.716866 1.246174 -0.732694
C  -3.652329 -0.296402 1.884336
C  -4.378626 1.737898 0.555361
C  -4.829423 0.575239 1.440252
C  -1.678657 -0.355713 -1.291426
C  -1.635701 -1.520146 0.676755
H  3.811628 1.647462 0.019412
H  4.334778 -0.492358 -0.908724
H  5.68204 0.402787 0.83278
H  5.146245 0.488105 2.507645
H  5.498102 -1.075871 1.772466
H  3.13372 -1.870118 2.414443
H  2.80155 -0.296892 3.125901
H  1.713233 -0.967755 1.91854
H  1.186142 1.189072 1.365374
H  0.190772 -3.026226 -0.587045
H  0.21197 -2.038461 -2.065686
H  -0.199745 3.887728 -0.069574
H  -0.948762 2.593482 -0.979262
H  -0.691951 2.411308 0.762079
H  2.664806 2.156321 -1.935309
H  1.026724 2.205722 -2.572216
H  1.738759 3.658366 -1.895378
H  -3.204224 2.061174 -1.247829
H  -4.468193 0.876196 -1.437979
H  -3.998307 -1.250278 2.288513
H  -3.098387 0.18427 2.697395
H  -3.667888 2.360627 1.107134
H  -5.228585 2.377826 0.314099
H  -5.544445 -0.040914 0.887404
H  -5.359784 0.952768 2.315712
totalener: -1094.84910330 hartree
nucrepener: 2219.17642074 hartree
electener: -3314.02552404 hartree
oneelecener: -5899.93257751 hartree
twoeener: 2585.90705346 hartree
kineticenergy: 1090.10311651 hartree
xcener: -105.974431869632 hartree
chargesum: 0.0000000
charge: -0.252641 -0.363917 -0.318886 -0.317708 -0.095453 0.129077 -0.040301 -0.123382 -0.245012 -0.274196 -0.169734 0.346477 -0.007927 0.072142 -0.241443 -0.251443 -0.080321 -0.076444 -0.090505 -0.071293 -0.128773 -0.133648 0.219122 0.245575 0.093255 0.085581 0.071371 0.086465 0.093510 0.093793 0.089619 0.087496 0.086914 0.125339 0.125617 0.106661 0.074541 0.072731 0.081931 0.102457 0.089151 0.103334 0.101079 0.094829 0.092053 0.074953 0.081393 0.075968 0.080596
qa: -0.2526 -0.3639 -0.3189 -0.3177 -0.0955 0.1291 -0.0403 -0.1234 -0.2450 -0.2742 -0.1697 0.3465 -0.0079 0.0721 -0.2414 -0.2514 -0.0803 -0.0764 -0.0905 -0.0713 -0.1288 -0.1336 0.2191 0.2456 0.0933 0.0856 0.0714 0.0865 0.0935 0.0938 0.0896 0.0875 0.0869 0.1253 0.1256 0.1067 0.0745 0.0727 0.0819 0.1025 0.0892 0.1033 0.1011 0.0948 0.0921 0.0750 0.0814 0.0760 0.0806
va: 2.0880 2.1426 2.1801 2.1899 3.1155 3.7569 3.8007 3.8754 3.9085 3.9220 3.8548 4.2091 3.7457 3.9237 3.9495 3.9506 3.5746 3.6194 3.9174 3.9213 3.8870 3.8954 4.2460 4.2641 1.0060 1.0281 1.0086 1.0039 1.0043 1.0045 0.9994 1.0144 1.0084 0.9996 1.0101 0.9997 1.0049 1.0071 1.0090 1.0026 0.9999 1.0113 1.0092 1.0177 1.0099 1.0117 1.0131 1.0086 1.0120
dispcorr: -0.028303046 hartree
energy: -1094.877406346879
dipole: 2.59741 -3.81709 -1.21969 18.67002 -17.40160 1.26842 9.83528 -8.89388 0.94140
magnitude: 1.99569 au
magnitude: 5.07263 debye
