program: Orca
programVersion: 5.0.2
elementType: O O O O N C C C C C C C C C C C C C C C C C C C H H H H H H H H H H H H H H H H H H H H H H H H H
charge: 0
multiplicity: 1
keywords: wb97x-d3
keywords: def2-TZVPP
keywords: def2/J RIJCOSX
keywords: DEFGRID2
keywords: scfconv7
keywords: smallprint printgap noloewdin
keywords: NOSOSCF
formula: C19H25NO4
InChI: InChI=1/C19H25NO4/c1-11(2)9-14-15(19(14,3)4)18(23)24-10-20-16(21)12-7-5-6-8-13(12)17(20)22/h9,14-15H,5-8,10H2,1-4H3
49 atoms
O  1.129999 -1.251488 -0.591831
O  2.63274 -2.561669 -1.582729
O  -1.420534 -2.584449 1.367375
O  -1.37941 0.090534 -2.311465
N  -1.138282 -1.495585 -0.650444
C  3.414863 0.072385 0.878742
C  3.196403 0.88103 -0.36273
C  3.403172 -0.620534 -0.472002
C  4.776623 0.158478 1.530083
C  2.30267 -0.123235 1.881422
C  1.912489 1.546504 -0.711383
C  2.377922 -1.578835 -0.938172
C  1.419013 2.612783 -0.080785
C  0.084274 -2.084349 -1.071395
C  0.139753 3.255009 -0.528788
C  2.081949 3.262326 1.095435
C  -2.853933 -0.755012 0.694405
C  -2.836723 0.034577 -0.37935
C  -3.812435 -0.64221 1.821995
C  -3.781128 1.151329 -0.632791
C  -4.529693 0.707488 1.749549
C  -4.97031 1.043228 0.324293
C  -1.747514 -1.742285 0.579645
C  -1.72322 -0.392449 -1.268111
H  4.071645 1.432672 -0.700802
H  4.377728 -0.92586 -0.834564
H  4.820353 1.005624 2.218314
H  4.99302 -0.744571 2.103631
H  5.575363 0.286033 0.798372
H  2.34647 -1.120591 2.322317
H  2.421855 0.596698 2.69354
H  1.312139 0.020259 1.462205
H  1.372076 1.168382 -1.572024
H  0.161414 -3.088411 -0.654578
H  0.107234 -2.143842 -2.159498
H  0.303628 4.293124 -0.829273
H  -0.310581 2.72724 -1.368904
H  -0.589216 3.281085 0.286192
H  3.017826 2.782096 1.373301
H  2.297155 4.312779 0.882851
H  1.42619 3.251547 1.969671
H  -4.530982 -1.466751 1.77033
H  -3.293219 -0.763458 2.77526
H  -3.255661 2.102626 -0.4963
H  -4.110284 1.14371 -1.674222
H  -5.392189 0.703598 2.417605
H  -3.858403 1.490384 2.114373
H  -5.536508 1.975735 0.316546
H  -5.650024 0.26513 -0.035029
totalener: -1094.84940063 hartree
nucrepener: 2192.90141885 hartree
electener: -3287.75081948 hartree
oneelecener: -5847.32184634 hartree
twoeener: 2559.57102686 hartree
kineticenergy: 1090.09098362 hartree
xcener: -105.970899343044 hartree
chargesum: -0.0000000
charge: -0.258711 -0.361193 -0.314932 -0.326658 -0.106074 0.058372 -0.016249 -0.074203 -0.245880 -0.252687 -0.196542 0.314294 -0.009790 0.073695 -0.235010 -0.248855 -0.075535 -0.056257 -0.075301 -0.069673 -0.135003 -0.134322 0.241819 0.228244 0.101851 0.087361 0.079643 0.096636 0.074544 0.109658 0.080504 0.088374 0.095621 0.126243 0.126778 0.094832 0.087312 0.074252 0.081760 0.097473 0.089411 0.092970 0.094891 0.087704 0.096404 0.080568 0.074831 0.080469 0.076361
qa: -0.2587 -0.3612 -0.3149 -0.3267 -0.1061 0.0584 -0.0162 -0.0742 -0.2459 -0.2527 -0.1965 0.3143 -0.0098 0.0737 -0.2350 -0.2489 -0.0755 -0.0563 -0.0753 -0.0697 -0.1350 -0.1343 0.2418 0.2282 0.1019 0.0874 0.0796 0.0966 0.0745 0.1097 0.0805 0.0884 0.0956 0.1262 0.1268 0.0948 0.0873 0.0743 0.0818 0.0975 0.0894 0.0930 0.0949 0.0877 0.0964 0.0806 0.0748 0.0805 0.0764
va: 2.0853 2.1474 2.1939 2.1737 3.1206 3.7129 3.8033 3.8495 3.9180 3.8994 3.8838 4.2399 3.6913 3.9185 3.9368 3.9417 3.6425 3.6163 3.9232 3.9219 3.8989 3.8990 4.2583 4.2467 1.0055 1.0271 1.0062 1.0031 1.0088 1.0062 1.0005 1.0121 1.0307 1.0052 1.0021 1.0013 1.0149 0.9962 1.0099 1.0034 0.9986 1.0076 1.0195 1.0108 1.0193 1.0118 1.0093 1.0117 1.0089
dispcorr: -0.027166089 hartree
energy: -1094.876566717056
dipole: 2.82302 -4.08648 -1.26346 22.33502 -20.91536 1.41966 13.78946 -12.78903 1.00043
magnitude: 2.14770 au
magnitude: 5.45903 debye
