program: Orca
programVersion: 5.0.2
elementType: O O O O N C C C C C C C C C C C C C C C C C C C H H H H H H H H H H H H H H H H H H H H H H H H H
charge: 0
multiplicity: 1
keywords: wb97x-d3
keywords: def2-TZVPP
keywords: def2/J RIJCOSX
keywords: DEFGRID2
keywords: scfconv7
keywords: smallprint printgap noloewdin
keywords: NOSOSCF
formula: C19H25NO4
InChI: InChI=1/C19H25NO4/c1-11(2)9-14-15(19(14,3)4)18(23)24-10-20-16(21)12-7-5-6-8-13(12)17(20)22/h9,14-15H,5-8,10H2,1-4H3
49 atoms
O  1.033069 -1.087104 -0.722987
O  2.522571 -1.973768 -2.118282
O  -1.572234 -3.017206 0.564482
O  -1.459317 0.829839 -1.858905
N  -1.240682 -1.251951 -0.888377
C  3.251724 -0.172396 1.084688
C  3.32926 0.864248 0.002025
C  3.329673 -0.620826 -0.357455
C  4.509768 -0.425584 1.884806
C  2.001581 -0.300808 1.922443
C  2.206078 1.762325 -0.339653
C  2.281314 -1.293289 -1.15705
C  2.235486 3.096711 -0.301873
C  -0.019226 -1.654199 -1.491849
C  1.031448 3.894568 -0.708073
C  3.413657 3.916629 0.128556
C  -2.998391 -1.060768 0.586522
C  -2.968489 0.065072 -0.12689
C  -3.996476 -1.376967 1.639075
C  -3.914493 1.198799 0.024687
C  -5.169779 -0.399343 1.541434
C  -4.698632 1.039994 1.32924
C  -1.879255 -1.93715 0.14564
C  -1.827938 -0.003682 -1.078387
H  4.310132 1.30961 -0.127943
H  4.300284 -0.992516 -0.664992
H  5.410241 -0.326301 1.277087
H  4.58962 0.282123 2.712159
H  4.507066 -1.432341 2.306887
H  1.825191 -1.337854 2.211496
H  2.133306 0.279504 2.837538
H  1.1061 0.070104 1.434715
H  1.280298 1.303535 -0.662171
H  0.041671 -2.742238 -1.490472
H  0.017469 -1.291685 -2.519111
H  0.673024 4.514709 0.117886
H  1.273067 4.577918 -1.526328
H  0.210389 3.258695 -1.037513
H  3.764571 4.552286 -0.689058
H  3.132355 4.589555 0.943161
H  4.257007 3.322978 0.47612
H  -4.335278 -2.410945 1.543397
H  -3.517406 -1.313116 2.621525
H  -3.374947 2.14832 0.001679
H  -4.591361 1.222639 -0.835512
H  -5.814485 -0.694477 0.708537
H  -5.780278 -0.46478 2.443159
H  -4.063948 1.339664 2.168191
H  -5.55338 1.717835 1.330546
totalener: -1094.84998403 hartree
nucrepener: 2146.40644936 hartree
electener: -3241.25643339 hartree
oneelecener: -5754.35536544 hartree
twoeener: 2513.09893205 hartree
kineticenergy: 1090.08499438 hartree
xcener: -105.969483333814 hartree
chargesum: -0.0000000
charge: -0.268053 -0.360034 -0.313673 -0.326516 -0.109269 0.145971 0.001210 -0.122122 -0.252811 -0.234352 -0.213608 0.328994 -0.020871 0.068439 -0.211502 -0.246018 -0.082268 -0.071349 -0.073436 -0.074260 -0.136323 -0.134783 0.252170 0.242955 0.086570 0.088317 0.073333 0.085361 0.092083 0.100756 0.079953 0.072882 0.087822 0.127438 0.130270 0.078172 0.082550 0.083910 0.090948 0.083741 0.078267 0.094913 0.093777 0.093728 0.093401 0.076256 0.080526 0.076272 0.080261
qa: -0.2681 -0.3600 -0.3137 -0.3265 -0.1093 0.1460 0.0012 -0.1221 -0.2528 -0.2344 -0.2136 0.3290 -0.0209 0.0684 -0.2115 -0.2460 -0.0823 -0.0713 -0.0734 -0.0743 -0.1363 -0.1348 0.2522 0.2430 0.0866 0.0883 0.0733 0.0854 0.0921 0.1008 0.0800 0.0729 0.0878 0.1274 0.1303 0.0782 0.0825 0.0839 0.0909 0.0837 0.0783 0.0949 0.0938 0.0937 0.0934 0.0763 0.0805 0.0763 0.0803
va: 2.0933 2.1464 2.1981 2.1731 3.1159 3.6672 3.7698 3.9139 3.9192 3.9150 3.9236 4.2263 3.7619 3.9165 3.9360 3.9427 3.6290 3.6194 3.9226 3.9269 3.8981 3.8983 4.2657 4.2528 1.0109 1.0268 1.0081 1.0040 1.0037 1.0049 1.0046 1.0155 1.0161 1.0047 1.0017 0.9971 0.9992 1.0170 0.9978 0.9997 1.0133 1.0191 1.0087 1.0189 1.0079 1.0085 1.0118 1.0088 1.0118
dispcorr: -0.024662450 hartree
energy: -1094.874646482134
dipole: 5.56629 -6.82862 -1.26233 20.11703 -19.08111 1.03592 14.98584 -13.68386 1.30197
magnitude: 2.08848 au
magnitude: 5.30850 debye
