program: Orca
programVersion: 5.0.2
elementType: O O O O N C C C C C C C C C C C C C C C C C C C H H H H H H H H H H H H H H H H H H H H H H H H H
charge: 0
multiplicity: 1
keywords: wb97x-d3
keywords: def2-TZVPP
keywords: def2/J RIJCOSX
keywords: DEFGRID2
keywords: scfconv7
keywords: smallprint printgap noloewdin
keywords: NOSOSCF
formula: C19H25NO4
InChI: InChI=1/C19H25NO4/c1-11(2)9-14-15(19(14,3)4)18(23)24-10-20-16(21)12-7-5-6-8-13(12)17(20)22/h9,14-15H,5-8,10H2,1-4H3
49 atoms
O  1.153579 -1.351171 -0.481181
O  2.609482 -2.662444 -1.54522
O  -1.364192 -0.514633 -2.540432
O  -1.334355 -1.951034 1.774173
N  -1.116875 -1.552229 -0.491311
C  3.586395 0.05501 0.675978
C  3.065135 0.874765 -0.462963
C  3.376033 -0.595904 -0.681146
C  5.033926 0.25729 1.062024
C  2.714714 -0.304653 1.856072
C  1.69002 1.430904 -0.557607
C  2.368359 -1.644938 -0.952489
C  1.164065 2.338486 0.26479
C  0.092153 -2.255361 -0.745343
C  -0.22592 2.859127 0.049496
C  1.880096 2.917149 1.446586
C  -2.758708 0.055334 -0.647868
C  -2.742002 -0.357009 0.619268
C  -3.683662 1.073995 -1.204193
C  -3.630026 0.154546 1.692726
C  -4.810868 1.344946 -0.205333
C  -4.289911 1.454595 1.227887
C  -1.690481 -0.658901 -1.395297
C  -1.672915 -1.379734 0.775751
H  3.812023 1.513108 -0.932094
H  4.285779 -0.806537 -1.231033
H  5.131159 1.08062 1.77304
H  5.441323 -0.638136 1.534569
H  5.659821 0.490528 0.199842
H  2.953688 -1.306688 2.216975
H  2.908199 0.387529 2.677235
H  1.651347 -0.267829 1.640829
H  1.096809 1.109593 -1.407242
H  0.153735 -3.121007 -0.085922
H  0.109574 -2.588756 -1.782239
H  -0.22842 3.944733 -0.074649
H  -0.692526 2.41944 -0.831913
H  -0.862628 2.642091 0.912131
H  1.382992 2.643186 2.380407
H  2.917438 2.596722 1.512288
H  1.872727 4.00885 1.399432
H  -3.123942 1.990957 -1.41615
H  -4.080601 0.742849 -2.166356
H  -4.385948 -0.600419 1.931807
H  -3.061912 0.305343 2.613207
H  -5.338422 2.257939 -0.484062
H  -5.542967 0.534405 -0.260753
H  -5.103367 1.720166 1.90445
H  -3.559571 2.267563 1.285339
totalener: -1094.84802859 hartree
nucrepener: 2216.63418874 hartree
electener: -3311.48221732 hartree
oneelecener: -5894.69279741 hartree
twoeener: 2583.21058008 hartree
kineticenergy: 1090.10098978 hartree
xcener: -105.973621233212 hartree
chargesum: 0.0000000
charge: -0.257050 -0.360326 -0.314440 -0.317369 -0.100675 0.046174 -0.014814 -0.069115 -0.246109 -0.259242 -0.192038 0.315745 -0.010636 0.072555 -0.234161 -0.253873 -0.102387 -0.059723 -0.069258 -0.076777 -0.128513 -0.142615 0.220311 0.247579 0.100313 0.087169 0.080024 0.096669 0.073893 0.106551 0.077926 0.102914 0.101990 0.125299 0.127434 0.099966 0.076044 0.076608 0.093993 0.085570 0.096158 0.093194 0.098778 0.095243 0.095053 0.081114 0.077028 0.083110 0.074715
qa: -0.2570 -0.3603 -0.3144 -0.3174 -0.1007 0.0462 -0.0148 -0.0691 -0.2461 -0.2592 -0.1920 0.3157 -0.0106 0.0726 -0.2342 -0.2539 -0.1024 -0.0597 -0.0693 -0.0768 -0.1285 -0.1426 0.2203 0.2476 0.1003 0.0872 0.0800 0.0967 0.0739 0.1066 0.0779 0.1029 0.1020 0.1253 0.1274 0.1000 0.0760 0.0766 0.0940 0.0856 0.0962 0.0932 0.0988 0.0952 0.0951 0.0811 0.0770 0.0831 0.0747
va: 2.0834 2.1467 2.1864 2.1902 3.1110 3.7305 3.7966 3.8344 3.9196 3.8942 3.8834 4.2392 3.6975 3.9193 3.9531 3.9451 3.5966 3.5948 3.9185 3.9157 3.8870 3.8972 4.2560 4.2609 1.0056 1.0275 1.0065 1.0029 1.0091 1.0060 1.0009 1.0093 1.0245 1.0020 1.0073 1.0018 1.0115 0.9960 0.9962 1.0079 1.0045 1.0099 1.0206 1.0073 1.0196 1.0123 1.0093 1.0134 1.0117
dispcorr: -0.028647750 hartree
energy: -1094.876676337855
dipole: 3.30937 -4.46766 -1.15829 22.51581 -20.96918 1.54663 12.74711 -11.87870 0.86841
magnitude: 2.11845 au
magnitude: 5.38467 debye
