program: Orca
programVersion: 5.0.2
elementType: O O O O N C C C C C C C C C C C C C C C C C C C H H H H H H H H H H H H H H H H H H H H H H H H H
charge: 0
multiplicity: 1
keywords: wb97x-d3
keywords: def2-TZVPP
keywords: def2/J RIJCOSX
keywords: DEFGRID2
keywords: scfconv7
keywords: smallprint printgap noloewdin
keywords: NOSOSCF
formula: C19H25NO4
InChI: InChI=1/C19H25NO4/c1-11(2)9-14-15(19(14,3)4)18(23)24-10-20-16(21)12-7-5-6-8-13(12)17(20)22/h9,14-15H,5-8,10H2,1-4H3
49 atoms
O  0.28521 -0.218316 0.218713
O  2.003434 -0.846761 1.490698
O  -1.768263 -2.628038 -1.079507
O  -2.665786 0.925895 1.618639
N  -1.881914 -0.920756 0.472506
C  3.756204 0.325144 -0.819765
C  3.538152 1.483138 0.104266
C  2.346697 0.645636 -0.366943
C  4.048726 0.652635 -2.265794
C  4.471347 -0.918766 -0.352979
C  4.000789 1.496688 1.502918
C  1.581466 -0.214956 0.556931
C  4.444339 2.5614 2.177622
C  -0.576535 -1.013551 1.023546
C  4.902822 2.420313 3.599647
C  4.534941 3.959107 1.643022
C  -3.688961 -1.164418 -0.932223
C  -3.952053 -0.124224 -0.141841
C  -4.589921 -1.679235 -1.993602
C  -5.199369 0.679372 -0.174908
C  -5.678252 -0.643299 -2.283898
C  -6.259763 -0.05567 -0.997562
C  -2.348955 -1.705487 -0.580771
C  -2.798945 0.084562 0.775123
H  3.559512 2.44968 -0.386359
H  1.723232 1.126445 -1.111536
H  3.7362 -0.162187 -2.921307
H  3.534976 1.557255 -2.593959
H  5.118864 0.808062 -2.414101
H  4.270413 -1.185778 0.679387
H  4.186353 -1.771241 -0.97191
H  5.548348 -0.778803 -0.460173
H  3.979674 0.551783 2.029701
H  -0.592016 -0.64627 2.049694
H  -0.256456 -2.055492 1.019392
H  4.813521 1.396212 3.959281
H  5.946661 2.725987 3.709542
H  4.319509 3.061152 4.265937
H  3.93211 4.639355 2.249698
H  5.563066 4.325488 1.697033
H  4.205087 4.063287 0.611976
H  -4.018738 -1.915623 -2.894084
H  -5.032122 -2.625989 -1.666822
H  -5.552173 0.874159 0.840321
H  -4.984051 1.662405 -0.606091
H  -5.253282 0.162627 -2.889294
H  -6.470265 -1.095596 -2.882438
H  -6.686329 -0.862052 -0.39398
H  -7.080987 0.622951 -1.232181
totalener: -1094.85433503 hartree
nucrepener: 2039.96218269 hartree
electener: -3134.81651772 hartree
oneelecener: -5541.82124081 hartree
twoeener: 2407.00472308 hartree
kineticenergy: 1090.08823019 hartree
xcener: -105.971278652709 hartree
chargesum: -0.0000000
charge: -0.265652 -0.397590 -0.316564 -0.315827 -0.129535 0.087516 0.034907 -0.072773 -0.239029 -0.258256 -0.205689 0.348046 -0.062737 0.095327 -0.202739 -0.242088 -0.086618 -0.091101 -0.074881 -0.074540 -0.136426 -0.135705 0.260683 0.263690 0.084293 0.078560 0.089765 0.069154 0.088753 0.102005 0.087776 0.086991 0.102596 0.123827 0.121710 0.081511 0.080888 0.082109 0.087628 0.085789 0.076738 0.094546 0.092654 0.094225 0.093772 0.076066 0.080435 0.075429 0.080362
qa: -0.2657 -0.3976 -0.3166 -0.3158 -0.1295 0.0875 0.0349 -0.0728 -0.2390 -0.2583 -0.2057 0.3480 -0.0627 0.0953 -0.2027 -0.2421 -0.0866 -0.0911 -0.0749 -0.0745 -0.1364 -0.1357 0.2607 0.2637 0.0843 0.0786 0.0898 0.0692 0.0888 0.1020 0.0878 0.0870 0.1026 0.1238 0.1217 0.0815 0.0809 0.0821 0.0876 0.0858 0.0767 0.0945 0.0927 0.0942 0.0938 0.0761 0.0804 0.0754 0.0804
va: 2.1181 2.0900 2.1985 2.1992 3.1191 3.7430 3.7785 3.8728 3.9097 3.9191 3.9019 4.1554 3.8289 3.9026 3.9369 3.9451 3.6218 3.6271 3.9254 3.9262 3.8987 3.8972 4.2769 4.2755 1.0096 1.0299 1.0050 1.0084 1.0038 1.0201 1.0021 1.0010 1.0274 1.0034 1.0037 1.0128 0.9976 0.9986 0.9990 0.9989 1.0170 1.0192 1.0080 1.0189 1.0084 1.0087 1.0115 1.0088 1.0116
dispcorr: -0.021606294 hartree
energy: -1094.875941325717
dipole: 18.14812 -19.22816 -1.08004 12.89524 -12.33335 0.56189 -3.66042 2.65664 -1.00378
magnitude: 1.57790 au
magnitude: 4.01071 debye
