program: Orca
programVersion: 5.0.2
elementType: O O O O N C C C C C C C C C C C C C C C C C C C H H H H H H H H H H H H H H H H H H H H H H H H H
charge: 0
multiplicity: 1
keywords: wb97x-d3
keywords: def2-TZVPP
keywords: def2/J RIJCOSX
keywords: DEFGRID2
keywords: scfconv7
keywords: smallprint printgap noloewdin
keywords: NOSOSCF
formula: C19H25NO4
InChI: InChI=1/C19H25NO4/c1-11(2)9-14-15(19(14,3)4)18(23)24-10-20-16(21)12-7-5-6-8-13(12)17(20)22/h9,14-15H,5-8,10H2,1-4H3
49 atoms
O  0.733893 -1.72822 0.219053
O  2.001933 -0.586393 1.678182
O  -1.17639 0.725976 1.275921
O  -2.450836 -3.417134 -0.108445
N  -1.50567 -1.506974 0.785293
C  3.890827 0.044331 -0.670544
C  2.744346 0.970396 -0.933724
C  2.483232 -0.507312 -0.672139
C  4.731822 -0.36158 -1.859149
C  4.692166 0.172916 0.601369
C  2.303962 2.021591 0.02067
C  1.761498 -0.913994 0.550992
C  2.935928 3.1822 0.196569
C  -0.240055 -2.021457 1.202259
C  2.404013 4.221129 1.137437
C  4.20178 3.551788 -0.514868
C  -3.160589 -0.046733 0.129421
C  -3.533945 -1.259401 -0.277475
C  -3.934013 1.201649 -0.084335
C  -4.799553 -1.567799 -0.989476
C  -5.020526 0.951903 -1.132106
C  -5.748092 -0.370834 -0.890811
C  -1.840812 -0.155844 0.806299
C  -2.478316 -2.237106 0.104011
H  2.59916 1.234596 -1.979112
H  2.202778 -1.08385 -1.546007
H  5.216636 -1.323736 -1.685112
H  4.140652 -0.448971 -2.771979
H  5.516495 0.375372 -2.043351
H  4.120734 0.573788 1.431481
H  5.094035 -0.795667 0.903096
H  5.5391 0.838996 0.4240
H  1.387987 1.84579 0.574851
H  0.03476 -1.594114 2.165099
H  -0.327514 -3.102986 1.288883
H  2.183061 5.153495 0.611044
H  1.493488 3.891086 1.635468
H  3.140028 4.465275 1.907643
H  4.062031 4.460425 -1.106734
H  4.998978 3.768764 0.20077
H  4.557947 2.769895 -1.183028
H  -4.376689 1.521981 0.864503
H  -3.267697 2.012323 -0.387687
H  -4.577583 -1.802753 -2.035503
H  -5.258361 -2.468771 -0.576131
H  -5.73298 1.778096 -1.129446
H  -4.564423 0.938885 -2.126321
H  -6.565392 -0.487346 -1.604013
H  -6.204611 -0.354446 0.103245
totalener: -1094.85040324 hartree
nucrepener: 2110.09997802 hartree
electener: -3204.95038126 hartree
oneelecener: -5682.38432405 hartree
twoeener: 2477.43394279 hartree
kineticenergy: 1090.08882534 hartree
xcener: -105.970319566460 hartree
chargesum: 0.0000000
charge: -0.275470 -0.360231 -0.327910 -0.319937 -0.113052 0.083804 -0.056417 -0.071289 -0.243496 -0.257935 -0.170807 0.321064 -0.032020 0.068880 -0.214183 -0.253553 -0.069164 -0.102517 -0.075476 -0.073600 -0.134017 -0.134826 0.257877 0.271360 0.097296 0.084003 0.093625 0.072434 0.082749 0.115422 0.093549 0.076294 0.114549 0.139508 0.113641 0.080690 0.087309 0.082289 0.095637 0.091357 0.077894 0.092569 0.095008 0.093131 0.093260 0.079826 0.075414 0.080631 0.074825
qa: -0.2755 -0.3602 -0.3279 -0.3199 -0.1131 0.0838 -0.0564 -0.0713 -0.2435 -0.2579 -0.1708 0.3211 -0.0320 0.0689 -0.2142 -0.2536 -0.0692 -0.1025 -0.0755 -0.0736 -0.1340 -0.1348 0.2579 0.2714 0.0973 0.0840 0.0936 0.0724 0.0827 0.1154 0.0935 0.0763 0.1145 0.1395 0.1136 0.0807 0.0873 0.0823 0.0956 0.0914 0.0779 0.0926 0.0950 0.0931 0.0933 0.0798 0.0754 0.0806 0.0748
va: 2.1051 2.1335 2.1822 2.1949 3.0884 3.7127 3.8820 3.8385 3.9033 3.9038 3.8881 4.1876 3.7528 3.8913 3.9386 3.9354 3.6083 3.6574 3.9246 3.9247 3.8980 3.8971 4.2700 4.2755 1.0039 1.0300 1.0048 1.0073 1.0064 1.0167 1.0063 0.9991 1.0087 1.0160 1.0121 0.9973 1.0120 0.9992 1.0033 0.9984 1.0092 1.0082 1.0195 1.0087 1.0192 1.0118 1.0089 1.0116 1.0088
dispcorr: -0.024224326 hartree
energy: -1094.874627564692
dipole: 14.65658 -15.68521 -1.02863 20.44844 -19.83744 0.61100 -8.40745 7.46154 -0.94591
magnitude: 1.52517 au
magnitude: 3.87667 debye
