program: Orca
programVersion: 5.0.2
elementType: O O O O N C C C C C C C C C C C C C C C C C C C H H H H H H H H H H H H H H H H H H H H H H H H H
charge: 0
multiplicity: 1
keywords: wb97x-d3
keywords: def2-TZVPP
keywords: def2/J RIJCOSX
keywords: DEFGRID2
keywords: scfconv7
keywords: smallprint printgap noloewdin
keywords: NOSOSCF
formula: C19H25NO4
InChI: InChI=1/C19H25NO4/c1-11(2)9-14-15(19(14,3)4)18(23)24-10-20-16(21)12-7-5-6-8-13(12)17(20)22/h9,14-15H,5-8,10H2,1-4H3
49 atoms
O  0.383783 -0.320869 0.307894
O  2.014774 -0.045617 1.800287
O  -2.444328 1.668911 0.676569
O  -1.903093 -2.847112 0.505469
N  -1.841701 -0.5578 0.807216
C  3.972801 -0.400481 -0.592189
C  3.596701 1.046618 -0.675744
C  2.507312 -0.025187 -0.556682
C  4.426842 -1.05558 -1.876896
C  4.683808 -0.953449 0.61904
C  3.865401 2.016168 0.399742
C  1.664111 -0.126761 0.651524
C  4.156058 3.310744 0.24144
C  -0.547857 -0.425774 1.376735
C  4.416198 4.179004 1.437112
C  4.256061 4.029443 -1.070788
C  -3.852938 -0.088202 -0.208367
C  -3.693645 -1.410286 -0.26054
C  -5.034927 0.650804 -0.718698
C  -4.660722 -2.363459 -0.859909
C  -6.173762 -0.33382 -0.993254
C  -5.678919 -1.594024 -1.704638
C  -2.665713 0.511307 0.45796
C  -2.394269 -1.761466 0.373591
H  3.638959 1.460257 -1.67686
H  1.958048 -0.209901 -1.472498
H  5.500975 -0.919508 -2.016258
H  4.226217 -2.12849 -1.860253
H  3.924958 -0.638223 -2.751174
H  4.36979 -0.510465 1.557867
H  4.517766 -2.029446 0.694725
H  5.757797 -0.792221 0.512124
H  3.819803 1.640528 1.414232
H  -0.520987 0.465701 2.003402
H  -0.331414 -1.301706 1.988816
H  4.319284 3.628171 2.371706
H  5.420919 4.608572 1.402188
H  3.719266 5.020463 1.470777
H  5.251168 4.464181 -1.195174
H  4.064037 3.400716 -1.937155
H  3.548728 4.861756 -1.106261
H  -5.339961 1.41802 -0.003518
H  -4.75881 1.190487 -1.630415
H  -4.135269 -3.110451 -1.459202
H  -5.160362 -2.922859 -0.062266
H  -6.640832 -0.615125 -0.045057
H  -6.948119 0.153144 -1.58769
H  -5.216362 -1.31359 -2.655484
H  -6.521199 -2.242567 -1.949769
totalener: -1094.85417458 hartree
nucrepener: 2043.20925019 hartree
electener: -3138.06342477 hartree
oneelecener: -5548.33098003 hartree
twoeener: 2410.26755526 hartree
kineticenergy: 1090.08224820 hartree
xcener: -105.970044051193 hartree
chargesum: -0.0000000
charge: -0.265066 -0.397412 -0.315687 -0.316432 -0.126664 0.091539 0.032716 -0.076032 -0.238832 -0.255175 -0.210387 0.349300 -0.059401 0.093905 -0.203315 -0.242541 -0.090796 -0.089089 -0.075154 -0.074392 -0.134443 -0.135581 0.263213 0.261272 0.083200 0.078150 0.088682 0.090182 0.068658 0.103259 0.085931 0.085619 0.104256 0.123014 0.122365 0.081168 0.080864 0.082912 0.086334 0.076636 0.087917 0.093645 0.093630 0.094773 0.092146 0.075374 0.079951 0.076134 0.079655
qa: -0.2651 -0.3974 -0.3157 -0.3164 -0.1267 0.0915 0.0327 -0.0760 -0.2388 -0.2552 -0.2104 0.3493 -0.0594 0.0939 -0.2033 -0.2425 -0.0908 -0.0891 -0.0752 -0.0744 -0.1344 -0.1356 0.2632 0.2613 0.0832 0.0781 0.0887 0.0902 0.0687 0.1033 0.0859 0.0856 0.1043 0.1230 0.1224 0.0812 0.0809 0.0829 0.0863 0.0766 0.0879 0.0936 0.0936 0.0948 0.0921 0.0754 0.0800 0.0761 0.0797
va: 2.1186 2.0909 2.1993 2.1984 3.1167 3.7377 3.7893 3.8764 3.9100 3.9158 3.9055 4.1553 3.8293 3.9023 3.9373 3.9457 3.6229 3.6265 3.9283 3.9265 3.8966 3.8988 4.2760 4.2767 1.0099 1.0299 1.0039 1.0050 1.0083 1.0206 1.0023 1.0012 1.0253 1.0048 1.0021 1.0130 0.9975 0.9986 0.9987 1.0168 0.9993 1.0191 1.0083 1.0189 1.0083 1.0088 1.0118 1.0087 1.0118
dispcorr: -0.021613522 hartree
energy: -1094.875788104614
dipole: 17.58357 -18.64432 -1.06075 9.61203 -9.61872 -0.00669 -9.76961 8.60091 -1.16870
magnitude: 1.57832 au
magnitude: 4.01178 debye
