program: Gaussian 09
title: 000068128
version: EM64L-G09RevD.01
frameworkgroup: C1[X(C15H24)]
method: RPBEPBE
basis: SDD
operation: Freq
keyword: #p
keyword: freq=noraman
keyword: PBEPBE/SDD
title: #p freq=noraman PBEPBE/SDD
converged: YES YES NO NO
title: Mulliken charges:
elementType: C C C C C C C C C C C C C C C H H H H H H H H H H H H H H H H H H H H H H H H
charge: -0.187969 -0.464961 -0.480327 -0.518343 0.617908 0.432854 -0.391033 -0.612045 -0.445671 -0.824920 -0.794936 -0.296095 0.369087 -0.784904 -0.793100 0.205623 0.211565 0.209256 0.224928 0.214046 0.209940 0.209416 0.207234 0.217858 0.212865 0.215368 0.201752 0.217309 0.219098 0.226488 0.219587 0.214700 0.213824 0.214959 0.228170 0.215274 0.226115 0.218740 0.220343
chargesum: 0.00000
title: Mulliken charges with hydrogens summed into heavy atoms:
elementType: C C C C C C C C C C C C C C C
charge: 0.017654 -0.044140 -0.041354 -0.098987 0.617908 0.432854 -0.183799 -0.181322 -0.028552 -0.162025 -0.360649 -0.082272 0.369087 -0.126501 -0.127903
polarizability: 1.81009251e+02 -2.52139737e+00 1.75836083e+02 6.45052835e+00 1.67475908e+00 1.29183068e+02
1716.lowfreq: -10.8593 -7.8727 0.0004 0.0005 0.0007 9.2617 13.2179 23.6827 27.2704
frequency: 10.4591 23.1970 26.9861 60.0363 84.8552 93.7825 127.2024 149.6968 170.9046 176.2069 189.2978 192.1893 254.9503 279.2638 294.2505 311.4288 331.4629 338.9415 395.1310 421.2121 438.4906 451.7047 495.4753 514.9816 538.6799 618.8790 652.0933 704.8052 749.4932 753.8867 790.6627 802.5925 814.5179 837.4166 903.3059 914.8510 917.6712 925.3746 946.3629 954.3920 985.3437 990.2205 993.3550 1008.2391 1021.3833 1022.9991 1037.8089 1057.6626 1076.4999 1081.5514 1112.6711 1126.3390 1140.8975 1145.5866 1164.1990 1203.8081 1222.9459 1232.6351 1253.8180 1257.2150 1275.3944 1296.5609 1311.9148 1314.8434 1316.9715 1330.0206 1357.3220 1361.2815 1367.6427 1387.7717 1392.8001 1398.4138 1428.2378 1452.8677 1455.2554 1455.8982 1458.7374 1461.8740 1467.5688 1470.0235 1471.6471 1472.5437 1473.9577 1480.8043 1656.6905 1694.7366 1694.8641 2942.2906 2955.1483 2955.7014 2956.1795 2962.0159 2962.9685 2963.9876 2973.8359 2980.7845 2997.3144 3006.9050 3021.9245 3024.2562 3027.0349 3031.2966 3043.9306 3045.9574 3065.7652 3074.9643 3079.5099 3084.3420 3090.1496 3092.9315 3181.6834
redmass: 2.8904 2.8678 3.4552 3.0377 2.7104 2.5408 1.0768 2.7696 1.3153 1.7729 1.4267 1.8788 2.2458 2.3371 2.8060 2.5797 2.4668 2.5110 2.3306 2.0557 2.4766 2.3547 3.0114 2.7869 2.9112 3.3332 3.7725 1.0830 2.1331 1.9456 1.7029 1.3066 1.7193 1.4423 2.2456 2.1304 1.6190 1.4272 1.3891 1.8929 2.0483 1.8014 1.4198 3.1954 1.6755 1.5549 1.6809 2.2105 1.9107 1.6656 1.5954 2.4454 1.5262 1.3909 1.9121 1.4443 1.8754 1.4359 1.4495 1.4429 1.1857 1.4043 1.3596 1.3790 1.4700 1.3583 1.5063 1.7218 1.7820 1.3116 1.2414 1.2331 1.1588 1.0902 1.0545 1.0764 1.0789 1.0492 1.0872 1.0864 1.0636 1.0523 1.0745 1.0897 4.8727 6.4727 6.5190 1.0618 1.0395 1.0659 1.0375 1.0636 1.0574 1.0533 1.0619 1.0728 1.0847 1.0983 1.0962 1.0965 1.0970 1.0964 1.1005 1.1011 1.0925 1.0980 1.0970 1.0621 1.0907 1.0956 1.1134
irintensity: 0.0268 0.0405 0.0273 0.1182 0.1369 0.3349 0.1126 0.1583 0.6387 0.4886 0.8329 0.1807 2.5629 0.4423 0.1320 1.4831 1.7592 0.9541 1.5990 6.4336 1.4156 3.6865 0.7792 3.0581 0.9765 5.4892 6.9286 0.7108 1.3353 5.1031 8.5539 7.3255 2.1778 20.6176 6.0896 7.1612 5.5635 53.2597 1.4361 1.2459 3.2510 0.9120 7.5699 0.5700 6.2699 4.1732 7.9071 3.2473 0.1610 3.1942 19.0854 2.8915 2.7832 0.8299 5.6360 2.8143 2.7269 4.5829 1.1438 6.5302 4.3327 1.3925 4.4507 3.0921 2.4513 3.1257 5.7012 7.8111 0.3397 24.9158 11.8133 9.3522 6.0429 2.6065 3.3970 7.3612 4.4220 10.3223 4.7084 9.7359 10.2987 25.0040 17.4451 12.0520 31.9254 2.8390 1.6217 29.7302 76.0603 8.4461 37.8638 52.5856 7.5005 33.1451 49.7253 15.7188 40.2215 43.6097 2.5553 30.7626 6.8044 49.6210 39.4123 49.0592 36.9802 23.9409 51.1527 9.4843 49.8993 41.1002 32.0356
temp: 298.150 k
press: 1.00000 atm
elementType: 6 6 6 6 6 6 6 6 6 6 6 6 6 6 6 1 1 1 1 1 1 1 1 1 1 1 1 1 1 1 1 1 1 1 1 1 1 1 1
symmnumber: 1
zpe: 909280.3 jmol-1
zpe.correction: 0.346327 hartree
zpe.thermalcorrener: 0.364040 hartree
zpe.thermalcorrenthalpy: 0.364984 hartree
zpe.thermalcorrgfe: 0.298086 hartree
zpe.sumelectzpe: -584.767672 hartree
zpe.sumelectthermal: -584.749959 hartree
zpe.sumelectthermalent: -584.749015 hartree
zpe.sumelectthermalfe: -584.815913 hartree
dipole: 0.2929 -0.9798 -0.0837
dipole: 1.0260
quadrupole: -90.8940 -92.6622 -95.1456
quadrupole: 0.3522 1.9692 0.3604
quadrupole: 2.0066 0.2384 -2.2450 0.3522 1.9692 0.3604
hfenergy: -585.1139987 hartree
pointgroup: C01 [X(C15H24)]
dipole: 0.1091118 -0.3877399 -0.0264717 debye
polarizability: 180.927464|-2.4934512|175.9565407|6.5219261|0.7914397|129.1443972 unknown
InChI: InChI=1S/C15H24/c1-12(2)6-5-7-14(4)15-10-8-13(3)9-11-15/h6,8,15H,4-5,7,9-11H2,1-3H3
charge 0 multiplicity 1
39 atoms
C  -1.113895 0.612826 0.094238
C  -1.858323 0.338117 -1.240898
C  -2.163771 0.837114 1.220917
C  -2.714489 -0.944879 -1.143854
C  -0.11327 1.773372 0.014259
C  -3.526388 -1.028252 0.144537
C  -3.268069 -0.20597 1.199456
C  1.32088 1.461106 0.420855
C  2.06777 0.569448 -0.624825
C  -4.621134 -2.076989 0.180028
C  -0.480328 3.020665 -0.387093
C  3.488724 0.261355 -0.200773
C  4.049582 -0.955036 0.06237
C  5.505532 -1.065035 0.490514
C  3.323351 -2.28553 -0.040792
H  -0.553461 -0.311111 0.351681
H  -1.131966 0.252532 -2.071508
H  -2.510948 1.202575 -1.473024
H  -2.59658 1.853973 1.11461
H  -1.659263 0.830975 2.208363
H  -2.063162 -1.84304 -1.218515
H  -3.400953 -1.004332 -2.013887
H  -3.887548 -0.289134 2.1049
H  1.330496 0.927641 1.393619
H  1.892696 2.399009 0.560068
H  2.076011 1.118237 -1.588919
H  1.490317 -0.357487 -0.796623
H  -4.212473 -3.086704 -0.027369
H  -5.387715 -1.882971 -0.597103
H  -5.1283 -2.109731 1.160206
H  0.242334 3.844611 -0.423913
H  -1.506055 3.259701 -0.693789
H  4.131637 1.149085 -0.082384
H  6.082246 -1.694746 -0.216425
H  5.993704 -0.076395 0.544601
H  5.592149 -1.547019 1.485119
H  2.261599 -2.180902 -0.316609
H  3.373097 -2.83083 0.922713
H  3.807763 -2.936046 -0.796349
