program: Orca
programVersion: 5.0.2
elementType: O O O O N C C C C C C C C C C C C C C C C C C C H H H H H H H H H H H H H H H H H H H H H H H H H
charge: 0
multiplicity: 1
keywords: wb97x-d3
keywords: def2-TZVPP
keywords: def2/J RIJCOSX
keywords: DEFGRID2
keywords: scfconv7
keywords: smallprint printgap noloewdin
keywords: NOSOSCF
formula: C19H25NO4
InChI: InChI=1/C19H25NO4/c1-11(2)9-14-15(19(14,3)4)18(23)24-10-20-16(21)12-7-5-6-8-13(12)17(20)22/h9,14-15H,5-8,10H2,1-4H3
49 atoms
O  0.185379 -0.227143 0.010979
O  2.14169 -1.234441 -0.333795
O  -2.012652 -0.504353 -2.536346
O  -2.470181 -1.641658 1.845568
N  -1.865982 -1.194427 -0.338152
C  3.089718 1.738522 -0.788698
C  3.471454 1.407529 0.621569
C  2.05647 1.125111 0.141148
C  2.870575 3.193238 -1.130036
C  3.677655 0.943809 -1.927623
C  4.446818 0.348869 0.962831
C  1.521538 -0.233585 -0.081457
C  5.629369 0.55841 1.546177
C  -0.472452 -1.4559 -0.271252
C  6.540126 -0.59095 1.861301
C  6.170952 1.903511 1.928688
C  -3.931893 -0.482776 -1.060715
C  -4.066506 -0.821258 0.221368
C  -5.023526 0.021773 -1.930564
C  -5.337835 -0.775677 0.986379
C  -6.22444 0.416098 -1.068137
C  -6.511765 -0.623083 0.016485
C  -2.516727 -0.69815 -1.466075
C  -2.745694 -1.269919 0.739702
H  3.498142 2.265526 1.285834
H  1.305482 1.817437 0.503529
H  3.813726 3.667406 -1.408479
H  2.184374 3.298631 -1.972478
H  2.454228 3.753224 -0.291464
H  4.632071 1.385309 -2.219193
H  3.860123 -0.098111 -1.682983
H  3.018887 0.973759 -2.797386
H  4.180471 -0.670112 0.71388
H  -0.282622 -2.183779 0.5179
H  -0.133578 -1.862854 -1.223834
H  7.507106 -0.476134 1.36432
H  6.746223 -0.647386 2.933531
H  6.115634 -1.545323 1.552165
H  6.401624 1.941833 2.996404
H  7.109366 2.099065 1.403243
H  5.497493 2.727361 1.702347
H  -4.672438 0.865401 -2.529046
H  -5.300731 -0.755464 -2.650093
H  -5.444893 -1.674877 1.597135
H  -5.306653 0.05962 1.693478
H  -6.027564 1.383811 -0.597906
H  -7.10345 0.552663 -1.699645
H  -6.715978 -1.589108 -0.454458
H  -7.413273 -0.351567 0.567542
totalener: -1094.85374924 hartree
nucrepener: 2035.50051303 hartree
electener: -3130.35426227 hartree
oneelecener: -5532.88218052 hartree
twoeener: 2402.52791825 hartree
kineticenergy: 1090.08709668 hartree
xcener: -105.970727123634 hartree
chargesum: 0.0000000
charge: -0.264594 -0.401198 -0.316544 -0.316663 -0.124178 0.125692 -0.005349 -0.102879 -0.247276 -0.256602 -0.226510 0.351759 -0.023536 0.090951 -0.213519 -0.241837 -0.088659 -0.092891 -0.073669 -0.076297 -0.135686 -0.135628 0.261427 0.265278 0.088188 0.079554 0.087540 0.092113 0.070537 0.084797 0.103369 0.092563 0.122397 0.123845 0.121249 0.080639 0.082939 0.082619 0.086940 0.085677 0.075852 0.094993 0.092583 0.093915 0.093621 0.076027 0.080223 0.075736 0.080492
qa: -0.2646 -0.4012 -0.3165 -0.3167 -0.1242 0.1257 -0.0053 -0.1029 -0.2473 -0.2566 -0.2265 0.3518 -0.0235 0.0910 -0.2135 -0.2418 -0.0887 -0.0929 -0.0737 -0.0763 -0.1357 -0.1356 0.2614 0.2653 0.0882 0.0796 0.0875 0.0921 0.0705 0.0848 0.1034 0.0926 0.1224 0.1238 0.1212 0.0806 0.0829 0.0826 0.0869 0.0857 0.0759 0.0950 0.0926 0.0939 0.0936 0.0760 0.0802 0.0757 0.0805
va: 2.1220 2.0800 2.1984 2.1976 3.1137 3.7270 3.8147 3.9726 3.9095 3.9224 3.8976 4.1384 3.7576 3.9025 3.9437 3.9488 3.6232 3.6316 3.9267 3.9274 3.8985 3.8970 4.2780 4.2754 1.0083 1.0296 1.0041 1.0050 1.0080 1.0036 1.0178 1.0019 1.0246 1.0042 1.0042 0.9984 0.9976 1.0118 0.9993 0.9997 1.0136 1.0187 1.0083 1.0192 1.0085 1.0087 1.0116 1.0088 1.0117
dispcorr: -0.021925991 hartree
energy: -1094.875675230971
dipole: 19.27355 -20.54806 -1.27451 14.15692 -13.26267 0.89425 1.46295 -1.50021 -0.03726
magnitude: 1.55739 au
magnitude: 3.95856 debye
