program: Gaussian 09
title: 000068103
version: EM64L-G09RevD.01
frameworkgroup: C1[X(C8H10O2)]
method: RPBEPBE
basis: SDD
operation: Freq
keyword: #pfreq=noraman
keyword: PBEPBE/SDD
title: #p freq=noraman PBEPBE/SDD
converged: NO YES NO NO
title: Mulliken charges:
elementType: O O C C C C C C C C H H H H H H H H H H
charge: -0.433713 -0.456922 0.125179 0.552539 0.210946 0.227866 -0.571373 -0.621742 -0.850931 -0.810189 0.253493 0.219685 0.227203 0.293682 0.227412 0.235357 0.220058 0.227727 0.366123 0.357601
chargesum: 0.00000
title: Mulliken charges with hydrogens summed into heavy atoms:
elementType: O O C C C C C C C C
charge: -0.067590 -0.099321 0.125179 0.552539 0.210946 0.227866 -0.317880 -0.402057 -0.102634 -0.127047
polarizability: 1.22542123e+02 -2.59621250e+00 1.07421669e+02 -3.15564900e-01 -2.16217957e-02 4.88167683e+01
1716.lowfreq: -9.3573 -5.6639 -0.0010 -0.0005 0.0007 8.4628 46.1155 117.5671 127.2912
frequency: 45.8230 117.5603 127.2839 191.1465 230.8298 275.9395 286.5395 296.1861 321.6924 347.6249 356.1436 445.8579 503.4494 563.5968 567.1733 572.0065 592.3306 708.0039 741.2360 811.6448 856.8844 910.8780 970.5747 1007.6289 1039.2984 1045.1829 1053.5452 1129.2382 1147.5028 1182.6189 1237.1795 1259.2996 1331.6112 1392.0258 1396.3006 1396.7509 1432.7266 1466.0861 1473.4977 1480.3522 1489.4363 1518.3497 1601.3704 1642.7974 2952.4165 2974.4968 3018.6396 3055.7111 3084.9919 3108.4422 3110.4427 3160.3163 3569.2091 3588.5620
redmass: 1.0177 2.3327 1.1618 4.5716 3.8458 2.7652 2.1494 3.1394 4.9302 1.1029 1.4298 5.3818 4.6593 4.9605 4.2437 3.9845 4.5587 2.5648 3.9744 1.5748 1.4422 2.1588 4.8028 1.3443 1.4667 1.5249 2.2898 2.9544 1.3262 1.3011 2.0472 1.4696 5.4101 4.3567 1.2266 1.3235 2.9840 1.0782 1.0550 1.1990 1.0448 3.5046 6.0980 7.0089 1.0409 1.0384 1.0982 1.0954 1.0997 1.0912 1.0927 1.0924 1.0652 1.0660
irintensity: 0.3516 1.1077 0.0885 4.0823 1.5340 1.6228 0.2508 0.3989 18.9831 271.7653 1.3962 0.6245 2.4935 3.1166 9.0630 9.8385 0.0853 4.1570 9.4548 39.9715 13.3797 17.4538 22.2397 0.7458 0.6168 21.5032 250.2938 11.5524 116.8732 17.3513 81.7561 21.2093 35.9102 6.3463 2.6922 18.1578 18.4114 14.7777 12.2558 55.6691 16.3102 35.7862 122.1509 64.3710 41.5225 35.7721 26.8666 23.4724 19.0462 15.0981 3.4190 3.8553 30.8682 30.3391
temp: 298.150 k
press: 1.00000 atm
elementType: 8 8 6 6 6 6 6 6 6 6 1 1 1 1 1 1 1 1 1 1
symmnumber: 1
zpe: 419808.1 jmol-1
zpe.correction: 0.159896 hartree
zpe.thermalcorrener: 0.170388 hartree
zpe.thermalcorrenthalpy: 0.171332 hartree
zpe.thermalcorrgfe: 0.124275 hartree
zpe.sumelectzpe: -460.549798 hartree
zpe.sumelectthermal: -460.539307 hartree
zpe.sumelectthermalent: -460.538363 hartree
zpe.sumelectthermalfe: -460.585419 hartree
dipole: -0.1850 1.7006 0.0666
dipole: 1.7119
quadrupole: -50.5493 -56.0419 -62.9330
quadrupole: -5.6926 -0.1501 -0.0401
quadrupole: 5.9588 0.4661 -6.4249 -5.6926 -0.1501 -0.0401
hfenergy: -460.7096945 hartree
pointgroup: C01 [X(C8H10O2)]
dipole: -0.0661705 0.6697407 0.0263778 debye
dipolederiv: -0.4821659 0.5435395 -0.0000931 0.5538327 -1.041108 0.0024185 -0.0003202 0.0004601 -0.417896 -0.3848267 -0.5366832 0.0000016 -0.5113256 -1.1276376 -0.0034229 -0.000379 -0.0004466 -0.423938 0.0696093 0.0008413 0.0044218 -0.0043768 -0.5328914 0.0004463 0.0017155 0.0000047 -0.1491858 0.406775 0.0048952 -0.0167279 -0.0342864 0.3378105 0.0010689 -0.089615 0.0005909 0.0012978 0.5900848 -0.4554389 0.0013812 -0.4495264 1.0072429 0.0016223 0.0096936 0.0013771 0.0929209 0.4684657 0.3867138 0.002884 0.3218928 1.1200733 -0.0023243 0.010261 -0.0029974 0.1040378 -0.4314574 0.2635832 -0.0019905 0.113721 -0.1820925 -0.0062173 0.0042322 -0.0005349 -0.2385191 -0.4361595 -0.2932335 -0.0031101 -0.0774488 -0.2284837 0.0066307 0.0047838 0.0027986 -0.2744983 -0.0740705 -0.0377988 -0.000294 -0.0076328 -0.0296341 -0.0003009 -0.0030962 0.0001583 0.1220912 -0.1249836 -0.0065955 0.012296 -0.0000826 0.0794049 -0.0047309 0.1143642 -0.0051621 0.0673292 0.0418292 -0.0777312 -0.0039341 -0.0730091 -0.0241 0.0006834 -0.006751 -0.0037031 0.1733114 0.0291967 0.0718062 -0.0040023 0.0777224 -0.1034973 -0.0007041 -0.0066306 0.0030151 0.1783205 -0.0282029 0.0328113 0.0425258 0.0922558 0.0455318 -0.1119721 0.0942972 -0.0882661 -0.0523343 0.1089391 -0.0253916 -0.0001603 -0.1196141 -0.0037945 -0.0006924 -0.0001119 -0.0001836 0.1261921 -0.0275264 0.0320004 -0.0419105 0.0907522 0.0460442 0.1126986 -0.0933635 0.0883351 -0.053322 -0.0371078 0.0013033 0.0590699 0.0044312 0.1057115 -0.0058874 0.1162273 -0.0045964 -0.1026518 0.016129 0.0281901 -0.0252172 0.1109273 -0.0666286 0.1047371 -0.0797843 0.0847181 0.0539449 0.0260139 -0.0269612 -0.0218314 -0.1094782 -0.0688966 -0.0949736 -0.0721227 -0.0764569 0.0649089 0.135954 -0.0962459 -0.0011803 -0.1046873 0.355277 -0.0000194 -0.0016218 -0.0010321 0.3496965 0.133504 0.1903953 -0.0021287 0.1259326 0.3116683 0.0009394 -0.0017786 0.0019214 0.378294 unknown
polarizability: 122.4898643|-2.7456196|107.4746893|-0.2114764|0.0021816|48.8160069 unknown
InChI: InChI=1S/C8H10O2/c1-5-3-7(9)6(2)8(10)4-5/h3-4,9-10H,1-2H3
charge 0 multiplicity 1
20 atoms
O  1.06805 -2.446861 -0.003919
O  1.157094 2.414662 -0.000888
C  1.165356 0.012457 0.002355
C  -1.714171 -0.006153 -0.016864
C  0.420705 -1.197481 -0.004272
C  0.414374 1.213669 -0.002905
C  -0.991289 -1.220022 -0.016116
C  -1.000001 1.217628 -0.014963
C  2.682502 0.011237 0.009393
C  -3.233715 -0.012508 0.006244
H  -1.503368 -2.186847 -0.024526
H  -1.548155 2.169551 -0.022344
H  3.102907 -0.489851 -0.886564
H  3.056601 1.045997 0.011322
H  3.094494 -0.490349 0.90894
H  -3.614766 0.009263 1.045928
H  -3.651813 0.866676 -0.515848
H  -3.638491 -0.920793 -0.473185
H  2.05136 -2.330571 0.00052
H  0.549725 3.194995 -0.006208
