program: Orca
programVersion: 5.0.2
elementType: O O O O N C C C C C C C C C C C C C C C C C C C H H H H H H H H H H H H H H H H H H H H H H H H H
charge: 0
multiplicity: 1
keywords: wb97x-d3
keywords: def2-TZVPP
keywords: def2/J RIJCOSX
keywords: DEFGRID2
keywords: scfconv7
keywords: smallprint printgap noloewdin
keywords: NOSOSCF
formula: C19H25NO4
InChI: InChI=1/C19H25NO4/c1-11(2)9-14-15(19(14,3)4)18(23)24-10-20-16(21)12-7-5-6-8-13(12)17(20)22/h9,14-15H,5-8,10H2,1-4H3
49 atoms
O  0.149823 0.260668 -0.909246
O  1.178001 2.152475 -0.299568
O  -2.717239 -0.925735 -2.706082
O  -2.018262 0.686757 1.489014
N  -2.145924 0.179389 -0.759281
C  2.854626 0.126558 1.432647
C  3.693103 0.41209 0.223241
C  2.231917 0.018998 0.051911
C  3.077501 -1.189176 2.13974
C  2.464691 1.240313 2.371899
C  4.210419 1.755433 -0.102975
C  1.177033 0.953972 -0.387252
C  5.480624 2.058517 -0.383484
C  -1.045757 0.957991 -1.217784
C  5.87004 3.47233 -0.700514
C  6.6209 1.086158 -0.410827
C  -3.763465 -1.448276 -0.58742
C  -3.561905 -0.973654 0.64166
C  -4.756488 -2.491954 -0.945467
C  -4.280032 -1.421971 1.860775
C  -5.741268 -2.675012 0.211506
C  -5.029471 -2.722695 1.564131
C  -2.842884 -0.75126 -1.526438
C  -2.498593 0.064537 0.583436
H  4.35526 -0.401318 -0.054031
H  2.068116 -0.994754 -0.294715
H  3.870755 -1.09616 2.883797
H  2.171884 -1.510313 2.657817
H  3.36335 -1.983478 1.448727
H  1.524785 1.004697 2.874133
H  3.23363 1.35231 3.138099
H  2.344206 2.202838 1.884727
H  3.493415 2.565363 -0.114211
H  -1.130291 1.075045 -2.297709
H  -1.059063 1.937022 -0.742078
H  5.01382 4.145067 -0.68581
H  6.606074 3.849158 0.014436
H  6.332994 3.540574 -1.688403
H  7.38223 1.371326 0.3198
H  6.332005 0.060382 -0.192795
H  7.112284 1.093377 -1.386932
H  -5.275783 -2.223206 -1.867946
H  -4.234377 -3.429413 -1.163124
H  -3.578976 -1.549066 2.688608
H  -4.973785 -0.637349 2.179714
H  -6.454812 -1.845867 0.208607
H  -6.323541 -3.585222 0.061237
H  -4.319428 -3.554657 1.568294
H  -5.747842 -2.92505 2.359804
totalener: -1094.85271941 hartree
nucrepener: 2060.34135966 hartree
electener: -3155.19407907 hartree
oneelecener: -5582.65194240 hartree
twoeener: 2427.45786333 hartree
kineticenergy: 1090.09771374 hartree
xcener: -105.973553340662 hartree
chargesum: 0.0000000
charge: -0.272712 -0.392693 -0.318715 -0.319363 -0.117595 0.094055 0.023255 -0.094483 -0.242649 -0.255157 -0.219503 0.367041 -0.046666 0.075064 -0.207702 -0.240709 -0.100135 -0.069662 -0.076391 -0.073762 -0.134456 -0.134976 0.270078 0.249304 0.086204 0.081748 0.088086 0.089882 0.069547 0.096697 0.085007 0.099776 0.114351 0.114561 0.136115 0.082063 0.081144 0.081225 0.085649 0.075181 0.086086 0.094258 0.093339 0.094049 0.092328 0.075719 0.079849 0.075498 0.080171
qa: -0.2727 -0.3927 -0.3187 -0.3194 -0.1176 0.0941 0.0233 -0.0945 -0.2426 -0.2552 -0.2195 0.3670 -0.0467 0.0751 -0.2077 -0.2407 -0.1001 -0.0697 -0.0764 -0.0738 -0.1345 -0.1350 0.2701 0.2493 0.0862 0.0817 0.0881 0.0899 0.0695 0.0967 0.0850 0.0998 0.1144 0.1146 0.1361 0.0821 0.0811 0.0812 0.0856 0.0752 0.0861 0.0943 0.0933 0.0940 0.0923 0.0757 0.0798 0.0755 0.0802
va: 2.1116 2.0964 2.1953 2.1899 3.0954 3.7509 3.7954 3.9049 3.9100 3.9267 3.8989 4.1368 3.7970 3.8930 3.9400 3.9456 3.6506 3.6129 3.9251 3.9261 3.8966 3.8983 4.2789 4.2838 1.0100 1.0299 1.0044 1.0048 1.0082 1.0037 1.0020 1.0184 1.0281 1.0084 1.0136 1.0127 0.9979 0.9982 0.9993 1.0162 0.9991 1.0192 1.0085 1.0193 1.0082 1.0087 1.0118 1.0088 1.0116
dispcorr: -0.022234194 hartree
energy: -1094.874953606095
dipole: 21.55198 -22.28556 -0.73358 -2.64553 1.34439 -1.30114 11.32130 -10.71703 0.60426
magnitude: 1.61128 au
magnitude: 4.09556 debye
