program: Orca
programVersion: 5.0.2
elementType: O O O O N C C C C C C C C C C C C C C C C C C C H H H H H H H H H H H H H H H H H H H H H H H H H
charge: 0
multiplicity: 1
keywords: wb97x-d3
keywords: def2-TZVPP
keywords: def2/J RIJCOSX
keywords: DEFGRID2
keywords: scfconv7
keywords: smallprint printgap noloewdin
keywords: NOSOSCF
formula: C19H25NO4
InChI: InChI=1/C19H25NO4/c1-11(2)9-14-15(19(14,3)4)18(23)24-10-20-16(21)12-7-5-6-8-13(12)17(20)22/h9,14-15H,5-8,10H2,1-4H3
49 atoms
O  1.0455 -1.651453 -0.887093
O  2.098725 -1.671813 1.095375
O  -1.866828 -1.861253 -2.586129
O  -1.159197 -0.798507 1.784402
N  -1.227163 -1.614843 -0.379687
C  4.248266 0.136716 -0.176319
C  3.099817 1.069008 0.01655
C  2.891635 -0.279474 -0.691278
C  5.240654 0.510569 -1.254953
C  4.905435 -0.550072 0.996557
C  2.487493 1.340247 1.337795
C  2.017155 -1.268151 -0.029294
C  1.308381 1.937312 1.51604
C  -0.040953 -2.411568 -0.394829
C  0.759972 2.190919 2.886366
C  0.432394 2.385775 0.385182
C  -2.989444 -0.316673 -1.10147
C  -2.78034 -0.008159 0.177642
C  -4.040031 0.2816 -1.962524
C  -3.577595 0.96649 0.963284
C  -4.605713 1.530196 -1.283252
C  -4.864522 1.300296 0.206148
C  -1.996173 -1.345813 -1.511283
C  -1.636766 -0.812857 0.684955
H  3.069588 1.906527 -0.674637
H  2.749346 -0.220182 -1.764294
H  5.997494 1.190034 -0.859262
H  5.753633 -0.373291 -1.637801
H  4.762401 1.007598 -2.100301
H  4.220864 -0.804763 1.798475
H  5.383368 -1.475465 0.671619
H  5.685404 0.096843 1.402821
H  3.044427 1.036247 2.216493
H  0.151867 -2.783371 0.610056
H  -0.190736 -3.243676 -1.0795
H  -0.158654 1.620116 3.040022
H  1.463592 1.90423 3.666464
H  0.511336 3.246153 3.02682
H  0.741739 1.990635 -0.580638
H  -0.599805 2.070545 0.554213
H  0.41315 3.476695 0.31311
H  -3.633434 0.517963 -2.948389
H  -4.829139 -0.456883 -2.137855
H  -3.793894 0.567176 1.956584
H  -2.982039 1.870154 1.132346
H  -3.898362 2.355986 -1.403937
H  -5.526416 1.83673 -1.781807
H  -5.574331 0.476598 0.325358
H  -5.335412 2.18061 0.645957
totalener: -1094.84927358 hartree
nucrepener: 2186.98921735 hartree
electener: -3281.83849093 hartree
oneelecener: -5836.01924877 hartree
twoeener: 2554.18075784 hartree
kineticenergy: 1090.09660587 hartree
xcener: -105.971549150284 hartree
chargesum: -0.0000000
charge: -0.268249 -0.357178 -0.317494 -0.302605 -0.099614 0.148189 -0.067174 -0.108018 -0.242239 -0.276862 -0.166095 0.335238 0.000307 0.070327 -0.206436 -0.254881 -0.071400 -0.096417 -0.076231 -0.063342 -0.132592 -0.134849 0.261953 0.208286 0.088890 0.084458 0.088795 0.090831 0.069739 0.101898 0.086910 0.087838 0.086918 0.137242 0.116369 0.089772 0.076711 0.080777 0.088033 0.046677 0.108385 0.094875 0.092334 0.098734 0.088881 0.074563 0.080623 0.076777 0.080343
qa: -0.2682 -0.3572 -0.3175 -0.3026 -0.0996 0.1482 -0.0672 -0.1080 -0.2422 -0.2769 -0.1661 0.3352 0.0003 0.0703 -0.2064 -0.2549 -0.0714 -0.0964 -0.0762 -0.0633 -0.1326 -0.1348 0.2620 0.2083 0.0889 0.0845 0.0888 0.0908 0.0697 0.1019 0.0869 0.0878 0.0869 0.1372 0.1164 0.0898 0.0767 0.0808 0.0880 0.0467 0.1084 0.0949 0.0923 0.0987 0.0889 0.0746 0.0806 0.0768 0.0803
va: 2.1123 2.1353 2.1955 2.1920 3.0874 3.7522 3.8823 3.8344 3.8999 3.9089 3.9058 4.1783 3.7393 3.9110 3.9351 3.9368 3.6232 3.5703 3.9315 3.9163 3.8935 3.9022 4.2803 4.2608 1.0035 1.0304 1.0046 1.0051 1.0067 1.0227 1.0040 0.9983 1.0147 1.0195 1.0036 1.0076 1.0145 0.9960 1.0103 1.0153 1.0002 1.0190 1.0078 1.0194 1.0077 1.0098 1.0113 1.0093 1.0116
dispcorr: -0.026644734 hartree
energy: -1094.875918311359
dipole: 6.78353 -7.76231 -0.97878 19.95412 -18.84674 1.10738 4.19422 -4.62997 -0.43575
magnitude: 1.54083 au
magnitude: 3.91649 debye
