program: Orca
programVersion: 5.0.2
elementType: O O O O N C C C C C C C C C C C C C C C C C C C H H H H H H H H H H H H H H H H H H H H H H H H H
charge: 0
multiplicity: 1
keywords: wb97x-d3
keywords: def2-TZVPP
keywords: def2/J RIJCOSX
keywords: DEFGRID2
keywords: scfconv7
keywords: smallprint printgap noloewdin
keywords: NOSOSCF
formula: C19H25NO4
InChI: InChI=1/C19H25NO4/c1-11(2)9-14-15(19(14,3)4)18(23)24-10-20-16(21)12-7-5-6-8-13(12)17(20)22/h9,14-15H,5-8,10H2,1-4H3
49 atoms
O  -0.418643 1.680337 1.317993
O  -0.487907 1.54144 -0.912933
O  2.474386 2.310836 -1.182955
O  1.801058 -0.051636 2.644199
N  1.888594 1.409332 0.864468
C  -3.510392 0.87965 -0.475814
C  -2.772233 -0.417772 -0.531495
C  -2.289552 0.667607 0.407877
C  -3.465281 1.793019 -1.675391
C  -4.828432 0.927292 0.256635
C  -3.325826 -1.672866 0.039703
C  -1.001231 1.330606 0.160423
C  -4.11957 -2.514878 -0.626597
C  0.855673 2.306661 1.278099
C  -4.629101 -3.773766 0.004777
C  -4.565269 -2.282635 -2.037252
C  3.393842 0.214719 -0.406526
C  3.198246 -0.482201 0.713188
C  4.288317 -0.189841 -1.517296
C  3.845392 -1.776148 1.038276
C  4.643468 -1.66984 -1.366119
C  5.006833 -2.025455 0.074759
C  2.557718 1.439048 -0.355265
C  2.229899 0.254318 1.559306
H  -2.158862 -0.538295 -1.420798
H  -2.514271 0.51255 1.457266
H  -2.587191 1.64105 -2.298008
H  -4.341132 1.603554 -2.299005
H  -3.496547 2.843131 -1.379086
H  -5.633057 0.560768 -0.384441
H  -4.827023 0.323779 1.163734
H  -5.072113 1.952771 0.540214
H  -3.059402 -1.90948 1.065702
H  1.033245 2.639783 2.297206
H  0.860296 3.176311 0.62224
H  -4.311439 -4.652993 -0.561564
H  -4.28109 -3.889868 1.030969
H  -5.721836 -3.791225 0.012838
H  -4.219641 -3.088695 -2.689753
H  -5.656243 -2.285361 -2.09961
H  -4.209913 -1.340471 -2.451882
H  3.810225 0.001515 -2.48052
H  5.190747 0.429212 -1.498272
H  4.18851 -1.783102 2.075307
H  3.100142 -2.57456 0.962318
H  3.791846 -2.276953 -1.685545
H  5.471391 -1.91569 -2.031814
H  5.868176 -1.42888 0.387361
H  5.311362 -3.07083 0.135584
elementType: O N C H
totalener: -1094.86827272 hartree
nucrepener: 2102.78731109 hartree
electener: -3197.65558381 hartree
oneelecener: -5668.33690545 hartree
twoeener: 2470.68132164 hartree
cpcmener: -0.03981703 hartree
kineticenergy: 1090.04870500 hartree
xcener: -105.974954436915 hartree
chargesum: 0.0000000
charge: -0.288409 -0.490911 -0.429791 -0.435094 -0.107303 0.117144 -0.013549 -0.114369 -0.298458 -0.277681 -0.246459 0.437465 -0.046938 0.085944 -0.229961 -0.248228 -0.064358 -0.074216 -0.078261 -0.070256 -0.132981 -0.138248 0.336177 0.334840 0.108290 0.093086 0.094097 0.096011 0.105107 0.097710 0.093705 0.101981 0.123584 0.146128 0.133968 0.095889 0.090496 0.094586 0.104484 0.097075 0.087069 0.092905 0.102403 0.093486 0.102770 0.078992 0.080562 0.078618 0.080896
qa: -0.2884 -0.4909 -0.4298 -0.4351 -0.1073 0.1171 -0.0135 -0.1144 -0.2985 -0.2777 -0.2465 0.4375 -0.0469 0.0859 -0.2300 -0.2482 -0.0644 -0.0742 -0.0783 -0.0703 -0.1330 -0.1382 0.3362 0.3348 0.1083 0.0931 0.0941 0.0960 0.1051 0.0977 0.0937 0.1020 0.1236 0.1461 0.1340 0.0959 0.0905 0.0946 0.1045 0.0971 0.0871 0.0929 0.1024 0.0935 0.1028 0.0790 0.0806 0.0786 0.0809
va: 2.1130 2.0159 2.0791 2.0749 3.0884 3.6705 3.8110 3.8555 3.8913 3.9121 3.8482 4.1375 3.7148 3.8893 3.9268 3.9342 3.6603 3.7011 3.9178 3.9152 3.9155 3.9193 4.1838 4.1889 1.0198 1.0359 1.0195 1.0000 0.9995 0.9995 1.0021 1.0027 1.0053 0.9939 1.0152 0.9954 1.0070 0.9964 0.9992 0.9978 1.0079 1.0161 1.0038 1.0154 1.0044 1.0065 1.0095 1.0062 1.0092
dispcorr: -0.023546397 hartree
energy: -1094.891819116536
dipole: -22.15180 22.25621 0.10441 -17.92150 16.50479 -1.41671 -9.98980 10.08018 0.09038
magnitude: 1.42343 au
magnitude: 3.61807 debye
