program: Orca
programVersion: 5.0.2
elementType: O O O O N C C C C C C C C C C C C C C C C C C C H H H H H H H H H H H H H H H H H H H H H H H H H
charge: 0
multiplicity: 1
keywords: wb97x-d3
keywords: def2-TZVPP
keywords: def2/J RIJCOSX
keywords: DEFGRID2
keywords: scfconv7
keywords: smallprint printgap noloewdin
keywords: NOSOSCF
formula: C19H25NO4
InChI: InChI=1/C19H25NO4/c1-11(2)9-14-15(19(14,3)4)18(23)24-10-20-16(21)12-7-5-6-8-13(12)17(20)22/h9,14-15H,5-8,10H2,1-4H3
49 atoms
O  -0.533129 1.74903 1.459066
O  -0.432018 -0.481872 1.598945
O  1.477511 2.712586 -0.585342
O  2.492113 -0.436028 2.534473
N  1.783555 1.351767 1.249991
C  -2.183619 0.212149 -1.054788
C  -2.869327 -0.704192 -0.076701
C  -2.236012 0.567623 0.421535
C  -0.885447 -0.245672 -1.673352
C  -3.007248 1.071472 -1.979975
C  -4.338511 -0.851414 -0.024878
C  -0.999495 0.51535 1.222304
C  -5.021611 -1.999816 -0.075545
C  0.741971 1.883262 2.07443
C  -6.51879 -2.006132 0.003507
C  -4.403079 -3.357352 -0.214825
C  2.906819 0.76196 -0.676426
C  3.19991 -0.16187 0.23956
C  3.407266 0.771472 -2.071598
C  4.103106 -1.318032 0.026022
C  4.0102 -0.595086 -2.40136
C  4.893754 -1.115122 -1.267734
C  1.984738 1.748251 -0.068131
C  2.476722 0.167086 1.491677
H  -2.302719 -1.601741 0.147273
H  -2.896144 1.394005 0.665285
H  -0.310743 -0.90797 -1.027141
H  -1.089924 -0.792477 -2.595721
H  -0.254378 0.607204 -1.933219
H  -2.427513 1.93312 -2.315926
H  -3.299625 0.505366 -2.866663
H  -3.915358 1.448866 -1.51189
H  -4.90729 0.069457 0.068467
H  0.777921 1.395691 3.047843
H  0.872621 2.952856 2.214187
H  -6.956763 -2.464143 -0.887099
H  -6.862978 -2.599422 0.854722
H  -6.931269 -1.002437 0.104635
H  -4.682327 -3.996264 0.626719
H  -4.777983 -3.854024 -1.113338
H  -3.316989 -3.344113 -0.276895
H  2.596983 1.018695 -2.76154
H  4.154185 1.563498 -2.184348
H  4.773496 -1.439348 0.879827
H  3.506926 -2.234539 -0.022999
H  3.202228 -1.308136 -2.587565
H  4.586727 -0.526049 -3.324318
H  5.703263 -0.402779 -1.086298
H  5.363184 -2.055146 -1.559213
elementType: O N C H
totalener: -1094.86896448 hartree
nucrepener: 2150.68859826 hartree
electener: -3245.55756274 hartree
oneelecener: -5763.87313311 hartree
twoeener: 2518.31557037 hartree
cpcmener: -0.04047089 hartree
kineticenergy: 1090.04404672 hartree
xcener: -105.974974159222 hartree
chargesum: -0.0000000
charge: -0.277373 -0.470762 -0.431887 -0.427726 -0.103730 0.129144 0.024397 -0.114346 -0.278636 -0.271801 -0.288855 0.401291 -0.046925 0.084348 -0.221297 -0.252552 -0.105756 -0.017332 -0.079863 -0.065632 -0.132917 -0.138023 0.326599 0.308968 0.092068 0.101753 0.090460 0.106959 0.090876 0.099281 0.097958 0.090175 0.123157 0.136324 0.144860 0.093563 0.093845 0.089351 0.096088 0.096757 0.090722 0.094503 0.105000 0.094381 0.102028 0.079476 0.081066 0.078351 0.081662
qa: -0.2774 -0.4708 -0.4319 -0.4277 -0.1037 0.1291 0.0244 -0.1143 -0.2786 -0.2718 -0.2889 0.4013 -0.0469 0.0843 -0.2213 -0.2526 -0.1058 -0.0173 -0.0799 -0.0656 -0.1329 -0.1380 0.3266 0.3090 0.0921 0.1018 0.0905 0.1070 0.0909 0.0993 0.0980 0.0902 0.1232 0.1363 0.1449 0.0936 0.0938 0.0894 0.0961 0.0968 0.0907 0.0945 0.1050 0.0944 0.1020 0.0795 0.0811 0.0784 0.0817
va: 2.1127 2.0333 2.0694 2.0801 3.0790 3.6914 3.7974 3.8209 3.9030 3.8989 3.8640 4.2087 3.7526 3.8909 3.9209 3.9413 3.7073 3.6072 3.9165 3.9052 3.9123 3.9184 4.1544 4.1998 1.0318 1.0318 1.0120 1.0014 1.0079 1.0024 1.0017 1.0046 1.0084 1.0133 0.9935 0.9963 0.9960 1.0084 0.9968 0.9970 1.0096 1.0137 1.0049 1.0150 1.0053 1.0073 1.0094 1.0063 1.0092
dispcorr: -0.025370240 hartree
energy: -1094.894334721351
dipole: -17.89885 18.28796 0.38912 -14.89276 14.75260 -0.14016 -18.49385 16.82297 -1.67087
magnitude: 1.72130 au
magnitude: 4.37520 debye
