program: Orca
programVersion: 5.0.2
elementType: O O O O N C C C C C C C C C C C C C C C C C C C H H H H H H H H H H H H H H H H H H H H H H H H H
charge: 0
multiplicity: 1
keywords: wb97x-d3
keywords: def2-TZVPP
keywords: def2/J RIJCOSX
keywords: DEFGRID2
keywords: scfconv7
keywords: smallprint printgap noloewdin
keywords: NOSOSCF
formula: C19H25NO4
InChI: InChI=1/C19H25NO4/c1-11(2)9-14-15(19(14,3)4)18(23)24-10-20-16(21)12-7-5-6-8-13(12)17(20)22/h9,14-15H,5-8,10H2,1-4H3
49 atoms
O  -0.319118 1.34505 -0.02368
O  -1.480471 0.979609 1.861961
O  2.950474 2.816876 -1.071465
O  1.554979 -0.635247 1.530659
N  1.964534 1.315302 0.378557
C  -2.537338 -1.423187 0.109441
C  -3.596323 -0.373706 0.264878
C  -2.218167 0.032536 -0.205145
C  -1.977884 -2.08086 1.346241
C  -2.592771 -2.352292 -1.077756
C  -4.730568 -0.256214 -0.678559
C  -1.336921 0.815967 0.67387
C  -6.025093 -0.388584 -0.373968
C  0.740803 1.989338 0.671057
C  -7.081312 -0.235862 -1.426333
C  -6.545897 -0.699084 0.995583
C  3.965394 0.676925 -0.565363
C  3.551931 -0.342324 0.189626
C  5.238138 0.712343 -1.325914
C  4.275416 -1.624053 0.365762
C  6.14536 -0.422408 -0.846981
C  5.378191 -1.733563 -0.688757
C  2.948283 1.755404 -0.499797
C  2.255239 0.027085 0.8045
H  -3.811435 -0.112519 1.295958
H  -2.112364 0.250326 -1.262408
H  -2.531522 -2.999556 1.549125
H  -0.930553 -2.3554 1.205744
H  -2.049586 -1.459314 2.235852
H  -3.272476 -3.182558 -0.875728
H  -2.933334 -1.857783 -1.986563
H  -1.606847 -2.774398 -1.279882
H  -4.472794 -0.045681 -1.71263
H  0.565295 1.999396 1.744224
H  0.813347 3.01509 0.317052
H  -6.658855 -0.000549 -2.402989
H  -7.67182 -1.150341 -1.524823
H  -7.784991 0.557822 -1.162055
H  -7.140838 -1.615621 0.97584
H  -5.76561 -0.83003 1.742697
H  -7.214878 0.092062 1.343615
H  5.025293 0.613823 -2.395005
H  5.726458 1.681753 -1.203603
H  4.69692 -1.665695 1.374969
H  3.580667 -2.464123 0.294518
H  6.969583 -0.551271 -1.549301
H  6.590451 -0.145408 0.112645
H  6.06169 -2.539261 -0.418939
H  4.931593 -2.008376 -1.648312
elementType: O N C H
totalener: -1094.86940042 hartree
nucrepener: 2065.59358351 hartree
electener: -3160.46298393 hartree
oneelecener: -5593.63309628 hartree
twoeener: 2433.17011234 hartree
cpcmener: -0.03804555 hartree
kineticenergy: 1090.04313500 hartree
xcener: -105.974939845648 hartree
chargesum: -0.0000000
charge: -0.285020 -0.479883 -0.434658 -0.442232 -0.092876 0.135704 0.028392 -0.123131 -0.289277 -0.263835 -0.288663 0.410610 -0.035450 0.078771 -0.223918 -0.253248 -0.080697 -0.056486 -0.072608 -0.070692 -0.135170 -0.136113 0.345632 0.336629 0.093890 0.093966 0.099735 0.093935 0.095296 0.096910 0.090156 0.098850 0.122962 0.143493 0.125764 0.089159 0.094171 0.094245 0.095887 0.090318 0.096926 0.102382 0.093449 0.101792 0.094153 0.081581 0.078884 0.081329 0.078988
qa: -0.2850 -0.4799 -0.4347 -0.4422 -0.0929 0.1357 0.0284 -0.1231 -0.2893 -0.2638 -0.2887 0.4106 -0.0354 0.0788 -0.2239 -0.2532 -0.0807 -0.0565 -0.0726 -0.0707 -0.1352 -0.1361 0.3456 0.3366 0.0939 0.0940 0.0997 0.0939 0.0953 0.0969 0.0902 0.0989 0.1230 0.1435 0.1258 0.0892 0.0942 0.0942 0.0959 0.0903 0.0969 0.1024 0.0934 0.1018 0.0942 0.0816 0.0789 0.0813 0.0790
va: 2.1093 2.0247 2.0780 2.0655 3.1024 3.6709 3.7735 3.8736 3.8973 3.9050 3.8725 4.1558 3.7272 3.8555 3.9226 3.9439 3.7158 3.6783 3.9182 3.9166 3.9134 3.9156 4.1951 4.1855 1.0301 1.0375 1.0024 1.0071 1.0161 1.0028 1.0037 1.0026 1.0077 1.0150 1.0161 1.0086 0.9963 0.9956 0.9973 1.0083 0.9973 1.0049 1.0154 1.0049 1.0152 1.0093 1.0068 1.0092 1.0067
dispcorr: -0.022751240 hartree
energy: -1094.892151663101
dipole: -19.63889 20.88247 1.24359 -18.24251 16.99125 -1.25126 -5.54844 4.32083 -1.22761
magnitude: 2.14923 au
magnitude: 5.46291 debye
