program: Gaussian 09
title: 000068100
version: EM64L-G09RevD.01
frameworkgroup: C1[X(C4H2Br2O3)]
method: RPBEPBE
basis: SDD
operation: Freq
keyword: #p
keyword: freq=noraman
keyword: PBEPBE/SDD
title: #p freq=noraman PBEPBE/SDD
converged: NO YES NO NO
title: Mulliken charges:
elementType: Br Br O O O C C C C H H
charge: 0.117790 0.109047 -0.366036 -0.172390 -0.154214 -0.199407 -0.056098 0.178241 -0.059859 0.204060 0.398865
chargesum: 0.00000
title: Mulliken charges with hydrogens summed into heavy atoms:
elementType: Br Br O O O C C C C
charge: 0.117790 0.109047 0.032829 -0.172390 -0.154214 -0.199407 -0.056098 0.178241 0.144202
polarizability: 1.28525310e+02 -1.53127300e+00 9.45170804e+01 5.50445392e-01 -1.76062011e+00 4.27332355e+01
1716.lowfreq: -7.9221 -6.7092 -0.0007 0.0002 0.0003 6.0309 22.3077 57.8422 108.2854
frequency: 21.3991 57.8334 108.2851 124.9685 152.7551 179.7978 193.6478 212.6342 338.9027 376.2877 543.8919 556.7870 582.8106 621.2680 655.2189 751.8762 906.4632 957.3917 1060.9077 1102.4284 1295.3717 1365.0120 1579.2530 1605.5715 1644.7824 2950.6130 3499.3729
redmass: 10.5843 13.6937 11.9023 4.7146 12.6992 15.2614 4.6449 35.6327 9.9172 4.7545 3.1339 3.0496 4.5080 10.0549 2.1768 11.2846 11.2278 1.7759 3.0013 4.5307 2.4080 1.1817 10.0385 10.2576 10.4455 1.0864 1.0641
irintensity: 1.8260 0.4253 0.3531 5.8132 2.2866 2.3604 13.4113 0.9569 5.5151 5.1859 22.0835 49.1349 34.8389 5.3266 180.2294 18.4934 33.1065 2.6900 368.9860 44.9353 75.1579 6.2151 127.9370 131.1233 203.0968 31.2292 54.7159
temp: 298.150 k
press: 1.00000 atm
elementType: 35 35 8 8 8 6 6 6 6 1 1
symmnumber: 1
zpe: 140235.4 jmol-1
zpe.correction: 0.053413 hartree
zpe.thermalcorrener: 0.063520 hartree
zpe.thermalcorrenthalpy: 0.064464 hartree
zpe.thermalcorrgfe: 0.014050 hartree
zpe.sumelectzpe: -405.500212 hartree
zpe.sumelectthermal: -405.490105 hartree
zpe.sumelectthermalent: -405.489161 hartree
zpe.sumelectthermalfe: -405.539575 hartree
dipole: -2.4406 1.8760 1.3112
dipole: 3.3459
quadrupole: -69.6733 -66.6546 -73.5491
quadrupole: 7.5708 -1.1604 6.2292
quadrupole: 0.2857 3.3044 -3.5901 7.5708 -1.1604 6.2292
hfenergy: -405.5536246 hartree
pointgroup: C01 [X(C4H2Br2O3)]
dipole: 1.1077135 -0.4726165 -0.5314944 debye
dipolederiv: -0.0434572 0.0214873 -0.0038276 0.2576827 -0.6738898 -0.0005792 0.0054604 0.0119569 0.0778904 -0.0194368 0.0348269 0.0025784 0.1175973 -0.5845515 0.0118922 -0.0078274 0.0179815 0.0611366 -0.5702711 0.0121541 0.4122091 -0.0826528 -0.3350429 0.1799308 0.4783277 0.1359875 -1.0220164 -0.741308 -0.1119975 -0.2476203 -0.2112066 -0.299831 -0.1242652 0.0161747 0.0078827 -0.8230047 -1.034207 0.0764795 -0.005623 0.2040045 -0.3101006 0.0044808 -0.022741 -0.003506 -0.2969175 0.1747299 -0.2521593 0.0519606 -0.5541202 0.8503764 0.0097323 -0.0145098 -0.0222429 -0.1699792 -0.8863357 0.0128293 -0.0218456 -0.2897059 0.6744981 -0.0119569 0.0488866 -0.0145872 -0.0794119 1.2988958 0.2977246 -0.112638 0.4724375 0.2496866 -0.0223572 -0.3973821 -0.0872698 1.6301533 1.5358785 -0.0234995 0.0059984 0.2048548 0.2550764 -0.0152769 0.0224854 0.0032355 0.1895431 0.0631909 0.0083043 -0.0015672 -0.0413578 -0.1557348 0.0119393 -0.0023643 0.0093959 0.1221177 0.2223207 -0.0761497 -0.0796248 -0.0775335 0.3295129 -0.0435402 -0.1265103 -0.0588341 0.3104886 unknown
polarizability: 104.4173133|-15.4773623|118.6741797|0.7227214|-0.7889326|42.6841333 unknown
InChI: InChI=1S/C4H2Br2O3/c5-2(1-7)3(6)4(8)9/h1,8H
charge 0 multiplicity 1
11 atoms
Br 0.588068 -2.432755 0.020949
Br -0.894026 2.079966 -0.033218
O  2.187327 0.42755 -1.238878
O  2.301677 0.541207 1.089307
O  -3.273957 0.03897 -0.002744
C  0.371386 -0.489327 0.001712
C  -0.843961 0.132765 0.002283
C  1.701028 0.219279 0.045331
C  -2.169198 -0.55119 0.023317
H  -2.09717 -1.661494 0.064594
H  3.070126 0.88993 -1.199555
