program: Orca
programVersion: 5.0.2
elementType: O O O O N C C C C C C C C C C C C C C C C C C C H H H H H H H H H H H H H H H H H H H H H H H H H
charge: 0
multiplicity: 1
keywords: wb97x-d3
keywords: def2-TZVPP
keywords: def2/J RIJCOSX
keywords: DEFGRID2
keywords: scfconv7
keywords: smallprint printgap noloewdin
keywords: NOSOSCF
formula: C19H25NO4
InChI: InChI=1/C19H25NO4/c1-11(2)9-14-15(19(14,3)4)18(23)24-10-20-16(21)12-7-5-6-8-13(12)17(20)22/h9,14-15H,5-8,10H2,1-4H3
49 atoms
O  -0.668215 1.764205 1.419453
O  -0.545571 2.007794 -0.801124
O  2.511238 2.37146 -0.722334
O  1.05026 -0.545085 2.445314
N  1.593724 1.209061 1.053071
C  -3.581799 1.239714 -0.807157
C  -2.792302 -0.016814 -0.899342
C  -2.474997 0.995546 0.202473
C  -3.432015 2.27963 -1.890022
C  -4.974712 1.189752 -0.226279
C  -3.329416 -1.351646 -0.538644
C  -1.162387 1.648494 0.174667
C  -2.582148 -2.38769 -0.146732
C  0.680041 2.179309 1.574468
C  -3.201032 -3.712813 0.176906
C  -1.09502 -2.319618 0.021343
C  2.947829 0.019221 -0.382288
C  2.519559 -0.840396 0.542652
C  3.856999 -0.316367 -1.503817
C  2.882664 -2.27658 0.606867
C  3.934047 -1.836189 -1.657944
C  4.077983 -2.541401 -0.309739
C  2.357582 1.350304 -0.101685
C  1.6346 -0.112871 1.482522
H  -2.049652 -0.01662 -1.693244
H  -2.814433 0.723631 1.194593
H  -4.221729 2.142619 -2.630976
H  -3.533636 3.288502 -1.48645
H  -2.482633 2.217944 -2.415867
H  -5.70018 0.903444 -0.989839
H  -5.061857 0.483125 0.598611
H  -5.262592 2.172257 0.151073
H  -4.403689 -1.489038 -0.619238
H  0.816699 2.290643 2.646936
H  0.873438 3.139136 1.097034
H  -4.283917 -3.699263 0.059714
H  -2.800387 -4.500338 -0.465992
H  -2.975152 -4.009531 1.203883
H  -0.608716 -3.117738 -0.543862
H  -0.664008 -1.372708 -0.299049
H  -0.822004 -2.476097 1.067117
H  3.512875 0.154371 -2.427326
H  4.847356 0.103491 -1.301033
H  3.105153 -2.569566 1.635174
H  2.018133 -2.875485 0.301389
H  3.029146 -2.192118 -2.157928
H  4.772586 -2.094187 -2.305542
H  4.990862 -2.195516 0.18259
H  4.190625 -3.615394 -0.460397
elementType: O N C H
totalener: -1094.86822037 hartree
nucrepener: 2186.87896139 hartree
electener: -3281.74718176 hartree
oneelecener: -5836.27838997 hartree
twoeener: 2554.53120821 hartree
cpcmener: -0.03969030 hartree
kineticenergy: 1090.05627739 hartree
xcener: -105.977332272110 hartree
chargesum: 0.0000000
charge: -0.286567 -0.490491 -0.429078 -0.433552 -0.101606 0.178469 -0.030145 -0.096504 -0.282135 -0.292178 -0.300139 0.396327 0.006978 0.089222 -0.232206 -0.256595 -0.033594 -0.087268 -0.077319 -0.065177 -0.133967 -0.138189 0.324717 0.309196 0.108097 0.091730 0.094697 0.101400 0.091381 0.100444 0.092479 0.098775 0.125933 0.144701 0.132668 0.090955 0.096961 0.095557 0.102135 0.078453 0.099083 0.093220 0.102504 0.094637 0.104549 0.078642 0.081349 0.080357 0.081097
qa: -0.2866 -0.4905 -0.4291 -0.4336 -0.1016 0.1785 -0.0301 -0.0965 -0.2821 -0.2922 -0.3001 0.3963 0.0070 0.0892 -0.2322 -0.2566 -0.0336 -0.0873 -0.0773 -0.0652 -0.1340 -0.1382 0.3247 0.3092 0.1081 0.0917 0.0947 0.1014 0.0914 0.1004 0.0925 0.0988 0.1259 0.1447 0.1327 0.0910 0.0970 0.0956 0.1021 0.0785 0.0991 0.0932 0.1025 0.0946 0.1045 0.0786 0.0813 0.0804 0.0811
va: 2.1033 2.0110 2.0794 2.0638 3.0868 3.6895 3.8257 3.8084 3.8788 3.9162 3.8935 4.1367 3.7330 3.8927 3.9275 3.9459 3.6359 3.6831 3.9172 3.9060 3.9149 3.9217 4.1869 4.1688 1.0215 1.0341 1.0009 0.9992 1.0195 0.9989 1.0009 1.0023 1.0022 0.9934 1.0155 1.0061 0.9961 0.9959 0.9987 1.0053 1.0018 1.0159 1.0030 1.0162 1.0063 1.0072 1.0091 1.0060 1.0093
dispcorr: -0.026324954 hartree
energy: -1094.894545322362
dipole: -14.48003 14.73755 0.25752 -17.78708 16.00269 -1.78438 -8.89699 8.94626 0.04927
magnitude: 1.80354 au
magnitude: 4.58424 debye
