program: Orca
programVersion: 5.0.2
elementType: O O O O N C C C C C C C C C C C C C C C C C C C H H H H H H H H H H H H H H H H H H H H H H H H H
charge: 0
multiplicity: 1
keywords: wb97x-d3
keywords: def2-TZVPP
keywords: def2/J RIJCOSX
keywords: DEFGRID2
keywords: scfconv7
keywords: smallprint printgap noloewdin
keywords: NOSOSCF
formula: C19H25NO4
InChI: InChI=1/C19H25NO4/c1-11(2)9-14-15(19(14,3)4)18(23)24-10-20-16(21)12-7-5-6-8-13(12)17(20)22/h9,14-15H,5-8,10H2,1-4H3
49 atoms
O  -0.599297 1.543075 1.444945
O  -0.261105 -0.667157 1.348007
O  2.700597 -0.377424 2.149171
O  1.157475 2.843437 -0.66354
N  1.724422 1.400979 1.042589
C  -2.309675 0.00834 -1.071811
C  -2.810623 -1.018784 -0.104613
C  -2.255029 0.284099 0.423085
C  -1.033237 -0.277038 -1.827185
C  -3.284255 0.852253 -1.854448
C  -4.24469 -1.352524 0.058468
C  -0.956633 0.293133 1.117046
C  -4.726306 -2.243921 0.929923
C  0.700922 1.759142 1.975823
C  -6.189913 -2.560245 0.989154
C  -3.877953 -3.000957 1.905795
C  3.223509 0.123853 -0.156981
C  2.779099 1.073214 -0.981429
C  4.214219 -0.920171 -0.514262
C  3.207677 1.25173 -2.389493
C  4.364092 -0.975057 -2.035582
C  4.465901 0.421801 -2.647484
C  2.554931 0.288389 1.155987
C  1.795266 1.906121 -0.250707
H  -2.133339 -1.856952 0.025707
H  -2.96077 1.029034 0.77476
H  -0.505424 0.64901 -2.065833
H  -0.348404 -0.925316 -1.28231
H  -1.265424 -0.773887 -2.770843
H  -3.62051 0.324941 -2.749255
H  -4.165683 1.127829 -1.276239
H  -2.804944 1.777897 -2.177912
H  -4.948919 -0.84484 -0.593627
H  0.859095 1.204365 2.900047
H  0.739002 2.822352 2.196611
H  -6.761746 -2.004897 0.246143
H  -6.365576 -3.626223 0.8227
H  -6.601582 -2.331417 1.975389
H  -4.286758 -2.90896 2.914847
H  -3.875722 -4.069102 1.672596
H  -2.843411 -2.663015 1.938374
H  5.172345 -0.685984 -0.039382
H  3.907753 -1.889396 -0.114554
H  2.393474 0.939586 -3.051573
H  3.383579 2.308106 -2.604357
H  5.24579 -1.56206 -2.294024
H  3.502556 -1.495625 -2.462401
H  4.640912 0.348758 -3.721076
H  5.330244 0.938706 -2.222208
elementType: O N C H
totalener: -1094.86758746 hartree
nucrepener: 2153.87074574 hartree
electener: -3248.73833320 hartree
oneelecener: -5770.34224058 hartree
twoeener: 2521.60390738 hartree
cpcmener: -0.03885451 hartree
kineticenergy: 1090.04660434 hartree
xcener: -105.975395515876 hartree
chargesum: 0.0000000
charge: -0.281480 -0.478283 -0.427124 -0.433812 -0.104258 0.157481 -0.053956 -0.073799 -0.275115 -0.300850 -0.266405 0.404862 -0.024821 0.084380 -0.233179 -0.256229 -0.022788 -0.102314 -0.074474 -0.063438 -0.133996 -0.138576 0.312111 0.325147 0.101777 0.101376 0.090893 0.091633 0.106905 0.104946 0.090127 0.100327 0.125259 0.135173 0.145743 0.089003 0.094281 0.095323 0.095203 0.100009 0.080140 0.102102 0.093379 0.102065 0.094985 0.081089 0.078971 0.081501 0.078706
qa: -0.2815 -0.4783 -0.4271 -0.4338 -0.1043 0.1575 -0.0540 -0.0738 -0.2751 -0.3009 -0.2664 0.4049 -0.0248 0.0844 -0.2332 -0.2562 -0.0228 -0.1023 -0.0745 -0.0634 -0.1340 -0.1386 0.3121 0.3251 0.1018 0.1014 0.0909 0.0916 0.1069 0.1049 0.0901 0.1003 0.1253 0.1352 0.1457 0.0890 0.0943 0.0953 0.0952 0.1000 0.0801 0.1021 0.0934 0.1021 0.0950 0.0811 0.0790 0.0815 0.0787
va: 2.1142 2.0160 2.0809 2.0668 3.0790 3.7538 3.8430 3.8089 3.8802 3.9096 3.8888 4.1682 3.7136 3.8940 3.9295 3.9425 3.6149 3.7174 3.9110 3.9124 3.9141 3.9213 4.1936 4.1573 1.0186 1.0285 1.0091 1.0125 1.0017 0.9982 1.0019 1.0018 1.0054 1.0140 0.9924 1.0074 0.9948 0.9960 0.9979 0.9970 1.0196 1.0036 1.0159 1.0062 1.0158 1.0094 1.0076 1.0093 1.0062
dispcorr: -0.025388880 hartree
energy: -1094.892976338573
dipole: -17.19933 17.48275 0.28342 -13.92433 13.98476 0.06043 -13.42271 11.97308 -1.44963
magnitude: 1.47831 au
magnitude: 3.75756 debye
