program: Orca
programVersion: 5.0.2
elementType: O O O O N C C C C C C C C C C C C C C C C C C C H H H H H H H H H H H H H H H H H H H H H H H H H
charge: 0
multiplicity: 1
keywords: wb97x-d3
keywords: def2-TZVPP
keywords: def2/J RIJCOSX
keywords: DEFGRID2
keywords: scfconv7
keywords: smallprint printgap noloewdin
keywords: NOSOSCF
formula: C19H25NO4
InChI: InChI=1/C19H25NO4/c1-11(2)9-14-15(19(14,3)4)18(23)24-10-20-16(21)12-7-5-6-8-13(12)17(20)22/h9,14-15H,5-8,10H2,1-4H3
49 atoms
O  -0.595573 1.462283 1.490941
O  -0.245373 -0.738535 1.289034
O  2.724454 -0.456823 2.134754
O  1.148575 2.839043 -0.571486
N  1.731084 1.349091 1.088381
C  -2.311227 0.044768 -1.088547
C  -2.802284 -1.030623 -0.172709
C  -2.248536 0.244327 0.419239
C  -1.041395 -0.194767 -1.869198
C  -3.299399 0.919622 -1.818913
C  -4.236131 -1.377188 -0.017955
C  -0.947853 0.227577 1.108282
C  -4.714883 -2.214347 0.907063
C  0.703276 1.664373 2.033528
C  -6.171123 -2.560007 0.969939
C  -3.860792 -2.875187 1.945244
C  3.223395 0.110782 -0.159896
C  2.772163 1.08389 -0.95241
C  4.211177 -0.92194 -0.554799
C  3.190401 1.304045 -2.357749
C  4.352024 -0.931257 -2.078035
C  4.447384 0.482742 -2.649377
C  2.566145 0.236213 1.162231
C  1.791046 1.891747 -0.190026
H  -2.122596 -1.873454 -0.086151
H  -2.957785 0.966193 0.809642
H  -0.342742 -0.858418 -1.361052
H  -1.281059 -0.652623 -2.830967
H  -0.526205 0.746198 -2.074582
H  -2.835371 1.869841 -2.088831
H  -3.629782 0.439838 -2.742475
H  -4.18377 1.145644 -1.223914
H  -4.935293 -0.934667 -0.721173
H  0.86251 1.072886 2.934356
H  0.733537 2.718065 2.296907
H  -6.320875 -3.638515 0.873457
H  -6.60099 -2.275671 1.933884
H  -6.74602 -2.06883 0.184927
H  -2.831773 -2.517748 1.95178
H  -4.276705 -2.708708 2.942429
H  -3.840264 -3.959097 1.799052
H  5.171918 -0.703138 -0.078243
H  3.90612 -1.902753 -0.183622
H  2.371618 1.010869 -3.02296
H  3.364736 2.366161 -2.543303
H  5.233102 -1.509657 -2.358842
H  3.488588 -1.441529 -2.514991
H  4.614191 0.441851 -3.726536
H  5.315011 0.989129 -2.216374
elementType: O N C H
totalener: -1094.86729228 hartree
nucrepener: 2156.41739511 hartree
electener: -3251.28468739 hartree
oneelecener: -5775.44312832 hartree
twoeener: 2524.15844093 hartree
cpcmener: -0.03850039 hartree
kineticenergy: 1090.03952356 hartree
xcener: -105.973607999022 hartree
chargesum: 0.0000000
charge: -0.281178 -0.479826 -0.426928 -0.433459 -0.105246 0.169639 -0.051528 -0.087761 -0.276327 -0.300561 -0.273283 0.407376 -0.021794 0.084234 -0.232260 -0.252310 -0.021284 -0.103883 -0.073566 -0.063855 -0.134083 -0.138335 0.309969 0.326583 0.101312 0.100517 0.091564 0.106901 0.090887 0.100229 0.103817 0.090635 0.126766 0.135879 0.145394 0.094436 0.095376 0.089265 0.077865 0.095477 0.100478 0.102016 0.093207 0.102035 0.095439 0.081153 0.078890 0.081545 0.078584
qa: -0.2812 -0.4798 -0.4269 -0.4335 -0.1052 0.1696 -0.0515 -0.0878 -0.2763 -0.3006 -0.2733 0.4074 -0.0218 0.0842 -0.2323 -0.2523 -0.0213 -0.1039 -0.0736 -0.0639 -0.1341 -0.1383 0.3100 0.3266 0.1013 0.1005 0.0916 0.1069 0.0909 0.1002 0.1038 0.0906 0.1268 0.1359 0.1454 0.0944 0.0954 0.0893 0.0779 0.0955 0.1005 0.1020 0.0932 0.1020 0.0954 0.0812 0.0789 0.0815 0.0786
va: 2.1155 2.0127 2.0811 2.0667 3.0808 3.7406 3.8462 3.8188 3.8778 3.9080 3.8833 4.1572 3.7109 3.8942 3.9293 3.9412 3.6144 3.7181 3.9106 3.9123 3.9146 3.9214 4.1945 4.1572 1.0200 1.0292 1.0121 1.0020 1.0093 1.0023 0.9979 1.0012 1.0036 1.0136 0.9924 0.9950 0.9961 1.0071 1.0210 0.9983 0.9977 1.0037 1.0159 1.0062 1.0158 1.0093 1.0075 1.0092 1.0061
dispcorr: -0.025542373 hartree
energy: -1094.892834649857
dipole: -17.29857 17.54689 0.24831 -13.00134 13.11619 0.11485 -13.54493 12.13424 -1.41069
magnitude: 1.43698 au
magnitude: 3.65250 debye
