program: Gaussian 09
title: 000068098
version: EM64L-G09RevD.01
frameworkgroup: C1[X(C8H9NO4)]
method: RPBEPBE
basis: SDD
operation: Freq
keyword: #pfreq=noraman
keyword: PBEPBE/SDD
title: #p freq=noraman PBEPBE/SDD
converged: YES YES NO NO
title: Mulliken charges:
elementType: O O O O N C C C C C C C C H H H H H H H H H
charge: -0.200799 -0.189180 -0.411164 -0.231673 -0.422265 0.229526 -0.509474 0.081351 -0.499011 0.095065 0.113192 -0.772275 0.188374 0.236713 0.255383 0.262327 0.303054 0.350646 0.255843 0.228684 0.256332 0.379348
chargesum: 0.00000
title: Mulliken charges with hydrogens summed into heavy atoms:
elementType: O O O O N C C C C C C C C
charge: -0.200799 -0.189180 -0.031815 -0.231673 -0.071619 0.229526 -0.017378 0.081351 0.066370 0.095065 0.113192 -0.031415 0.188374
polarizability: 1.42609932e+02 -1.69800753e+01 1.03984464e+02 -8.76393514e+00 -7.81250122e-01 6.84732473e+01
1716.lowfreq: -1.6937 -0.0008 0.0003 0.0005 4.3697 8.6732 24.2214 37.0396 63.3264
frequency: 24.1869 37.0037 63.2594 69.5475 90.9116 135.2309 165.1868 186.1525 238.7512 260.0058 291.8227 363.5258 412.1915 496.1724 506.3027 525.1986 581.8729 609.3578 615.7941 630.7589 637.4999 698.0332 720.4902 753.1127 773.7555 834.2845 877.3309 974.2640 1019.6055 1036.0425 1042.8570 1073.5717 1084.4580 1141.9158 1183.7922 1243.8850 1276.0501 1293.8694 1297.6808 1304.7452 1329.6519 1373.8673 1405.3519 1444.1459 1451.2295 1455.4384 1464.8833 1644.1903 1665.2509 1669.9632 1676.3576 2986.2488 2999.9200 3009.4706 3054.8286 3060.9161 3078.3805 3105.0303 3515.1275 3587.8796
redmass: 10.5195 4.4064 1.1535 5.3780 2.0498 4.5847 9.8633 7.7387 2.6985 3.6708 5.3932 8.4108 5.1420 4.5199 1.7598 5.8060 5.1844 1.1365 3.6348 7.1537 1.3541 5.1222 7.1237 3.3094 2.2855 2.2595 4.2973 1.9316 3.3423 1.6338 3.8992 2.3403 2.5014 2.6708 1.3800 1.4279 1.3508 2.7041 2.1514 1.5949 4.1488 1.8540 1.3056 1.0868 1.0566 1.0845 1.0751 7.7635 8.1674 8.7029 12.5289 1.0381 1.0629 1.0607 1.0979 1.0956 1.1000 1.0994 1.0640 1.0805
irintensity: 1.5937 0.1390 0.8765 1.3315 1.2123 1.0953 4.0384 1.9941 1.7060 1.2050 1.8167 17.2176 13.8565 19.7403 31.1794 36.3797 9.5587 108.7066 11.0526 2.8832 127.0961 18.7582 25.5876 9.1087 8.6115 11.8268 0.7984 5.1956 106.0034 8.9784 67.3927 110.5658 51.5911 25.4700 8.0255 3.6037 53.9453 57.5311 58.0945 39.6406 54.0484 38.1195 36.9577 23.1624 19.9509 8.1040 21.5336 552.8938 214.7512 31.8783 21.4549 6.4153 3.7783 16.2697 5.4560 7.4315 7.8914 13.0816 24.3251 81.3669
temp: 298.150 k
press: 1.00000 atm
elementType: 8 8 8 8 7 6 6 6 6 6 6 6 6 1 1 1 1 1 1 1 1 1
symmnumber: 1
zpe: 427955.7 jmol-1
zpe.correction: 0.163000 hartree
zpe.thermalcorrener: 0.176148 hartree
zpe.thermalcorrenthalpy: 0.177092 hartree
zpe.thermalcorrgfe: 0.121028 hartree
zpe.sumelectzpe: -664.964523 hartree
zpe.sumelectthermal: -664.951375 hartree
zpe.sumelectthermalent: -664.950431 hartree
zpe.sumelectthermalfe: -665.006494 hartree
dipole: 0.8397 1.1942 0.9886
dipole: 1.7631
quadrupole: -80.8161 -76.0500 -77.8229
quadrupole: 2.7218 7.2662 0.4995
quadrupole: -2.5865 2.1797 0.4068 2.7218 7.2662 0.4995
hfenergy: -665.1275226 hartree
pointgroup: C01 [X(C8H9N1O4)]
dipole: -0.3601512 0.5313634 -0.2629 debye
dipolederiv: -0.7166515 -0.1527799 0.031603 -0.3844037 -0.937677 -0.0273705 -0.0357643 -0.0698971 -0.3326538 -1.0444999 -0.3412179 0.0703028 -0.143533 -0.5564134 -0.0126404 0.1305849 0.0338306 -0.3471956 -0.8669993 -0.1759677 -0.5431015 -0.1303984 -0.444501 -0.0909662 -0.5258152 -0.1072578 -0.8062749 -0.7499664 0.0475021 0.2032371 0.0112491 -0.3518012 -0.1870433 -0.0347537 -0.1664224 -0.8932277 -1.0001544 -0.1171723 0.1015492 -0.1197434 -0.8948314 -0.0577146 0.1146987 -0.0816946 -0.3882436 0.4543252 0.0592071 -0.0810597 -0.0419257 -0.4708935 -0.0935289 -0.1915416 -0.1085804 -0.0793599 -0.1050253 -0.0245644 0.0176598 -0.1032749 0.0697184 -0.0166307 0.0303235 -0.0184574 0.0646523 -0.4711382 0.0894598 0.074833 0.2273269 0.4605906 0.0841609 0.14755 0.1002637 -0.0436725 -0.3602268 0.0273965 0.0728595 0.1898461 0.0935001 -0.077556 0.3380087 -0.0619861 -0.0224933 1.1852689 0.1260555 -0.1671714 0.4717547 1.1969223 0.0873662 -0.0878422 0.1597468 0.3037553 1.3622721 0.4314474 -0.1263495 0.1291752 1.0147405 0.0933623 -0.2110099 0.0541602 0.2993953 -0.0124633 -0.1079874 -0.0089696 -0.065478 -0.2319424 -0.0580257 -0.0086515 -0.0733491 0.0365802 1.5403905 0.0588361 0.1683482 0.0125796 0.2925829 0.3524925 0.22846 0.3347461 1.375202 0.0529007 0.0140674 -0.0013543 0.044862 -0.0816459 -0.0647254 -0.022183 -0.0441495 0.0591466 0.0606723 -0.0180017 0.0286948 -0.0028607 0.0476248 0.0796502 -0.0093257 0.0555493 -0.0009602 0.0625402 -0.0155909 0.0126013 -0.0275063 0.0587046 0.0921058 -0.0353246 0.0672105 -0.0199144 0.1535587 0.0138571 0.0070338 -0.0573161 0.0110015 -0.0474202 -0.0021613 -0.0201931 0.0997178 0.1983665 -0.0469843 0.0280932 -0.0515081 0.198441 -0.0232206 0.0303469 -0.0253066 0.3487104 0.066378 0.0039104 -0.0923433 -0.0152903 0.0617515 -0.0138887 -0.091539 -0.0515122 -0.0081804 -0.0763909 0.1131751 0.0400645 0.039372 0.0546626 -0.0122474 0.0332529 -0.0193058 0.0972665 0.1009219 -0.0182412 0.070532 -0.0312703 0.0356439 0.037399 0.0605929 0.0842774 0.0006929 0.1659207 0.0335933 0.0929371 0.0483433 0.373821 -0.0435584 0.1420935 -0.0416726 0.2570568 unknown
polarizability: 140.3369391|20.8577677|103.7565647|-4.1568901|9.1805395|70.9741387 unknown
InChI: InChI=1S/C8H9NO4/c1-4-5(2-3-6(10)11)8(13)9-7(4)12/h9-10H,2-3H2,1H3
charge 0 multiplicity 1
22 atoms
O  0.41171 -2.374703 -0.214538
O  3.901674 0.764494 -0.377452
O  -4.236748 -0.245394 -1.191344
O  -3.818459 0.3965 1.001256
N  2.400635 -1.083135 -0.400546
C  0.470654 0.072662 0.25933
C  -0.97308 0.243932 0.638944
C  1.491874 0.987987 0.218001
C  -1.933121 -0.140022 -0.514305
C  1.025578 -1.280898 -0.134587
C  2.758717 0.274623 -0.212243
C  1.509423 2.454513 0.521525
C  -3.383885 0.041941 -0.116708
H  -1.169355 1.281666 0.958739
H  -1.207778 -0.400284 1.50805
H  -1.742303 0.46438 -1.420783
H  -1.78063 -1.195944 -0.805448
H  3.045391 -1.817216 -0.694087
H  2.138203 2.66175 1.407988
H  0.498498 2.849176 0.712132
H  1.962823 3.018188 -0.314201
H  -5.18242 -0.131517 -0.900723
