program: Orca
programVersion: 5.0.2
elementType: O O O O N C C C C C C C C C C C C C C C C C C C H H H H H H H H H H H H H H H H H H H H H H H H H
charge: 0
multiplicity: 1
keywords: wb97x-d3
keywords: def2-TZVPP
keywords: def2/J RIJCOSX
keywords: DEFGRID2
keywords: scfconv7
keywords: smallprint printgap noloewdin
keywords: NOSOSCF
formula: C19H25NO4
InChI: InChI=1/C19H25NO4/c1-11(2)9-14-15(19(14,3)4)18(23)24-10-20-16(21)12-7-5-6-8-13(12)17(20)22/h9,14-15H,5-8,10H2,1-4H3
49 atoms
O  -0.621888 0.475745 1.325949
O  -1.588396 2.490253 1.137501
O  2.377486 -1.256157 1.862942
O  1.351183 2.567351 -0.358552
N  1.671967 0.798273 1.084726
C  -2.298102 0.002021 -1.284261
C  -2.713892 -0.848919 -0.132748
C  -2.602369 0.65156 0.061183
C  -0.876361 -0.093585 -1.784575
C  -3.288729 0.310065 -2.380764
C  -4.043583 -1.50604 -0.054145
C  -1.571955 1.308044 0.881584
C  -4.598492 -1.95305 1.075488
C  0.548573 1.000605 1.93988
C  -5.926658 -2.6455 1.073641
C  -3.954478 -1.808849 2.41997
C  3.314706 -0.263458 -0.135195
C  3.013069 0.859079 -0.790152
C  4.349684 -1.241494 -0.547473
C  3.672419 1.322562 -2.035257
C  4.770664 -0.960787 -1.991062
C  4.964616 0.532619 -2.248448
C  2.438356 -0.363143 1.055635
C  1.926487 1.551133 -0.057203
H  -1.903053 -1.415865 0.314497
H  -3.536901 1.20112 0.080154
H  -0.520569 0.871132 -2.151092
H  -0.177754 -0.451939 -1.03083
H  -0.832916 -0.795242 -2.6198
H  -3.007584 1.227995 -2.899865
H  -3.305996 -0.493853 -3.119493
H  -4.303697 0.442789 -2.006902
H  -4.58125 -1.651758 -0.986522
H  0.706168 0.452006 2.864703
H  0.445722 2.057464 2.172343
H  -6.348456 -2.723559 0.071812
H  -5.843014 -3.654922 1.484778
H  -6.645131 -2.115632 1.704072
H  -3.033982 -1.227893 2.39801
H  -4.637978 -1.326195 3.122673
H  -3.721885 -2.788956 2.844399
H  5.206758 -1.161186 0.128643
H  3.97469 -2.261809 -0.4397
H  2.987885 1.182444 -2.877789
H  3.87308 2.394909 -1.984121
H  5.69123 -1.501472 -2.213238
H  4.006609 -1.34868 -2.670325
H  5.326527 0.693279 -3.264465
H  5.73549 0.918442 -1.575627
elementType: O N C H
totalener: -1094.86695089 hartree
nucrepener: 2140.72436354 hartree
electener: -3235.59131443 hartree
oneelecener: -5743.30105038 hartree
twoeener: 2507.70973595 hartree
cpcmener: -0.04095070 hartree
kineticenergy: 1090.03936504 hartree
xcener: -105.973737799056 hartree
chargesum: -0.0000000
charge: -0.274807 -0.481528 -0.433305 -0.428173 -0.085866 0.158680 -0.000478 -0.117165 -0.266138 -0.302500 -0.309557 0.419964 -0.008125 0.062394 -0.230256 -0.249589 -0.068891 -0.025089 -0.068104 -0.070311 -0.137015 -0.134821 0.342548 0.267629 0.107308 0.094659 0.099091 0.077287 0.101811 0.100441 0.100940 0.092228 0.126948 0.129134 0.139515 0.089645 0.095070 0.095644 0.079612 0.095910 0.102067 0.102007 0.093380 0.102506 0.095075 0.080974 0.079434 0.081476 0.078339
qa: -0.2748 -0.4815 -0.4333 -0.4282 -0.0859 0.1587 -0.0005 -0.1172 -0.2661 -0.3025 -0.3096 0.4200 -0.0081 0.0624 -0.2303 -0.2496 -0.0689 -0.0251 -0.0681 -0.0703 -0.1370 -0.1348 0.3425 0.2676 0.1073 0.0947 0.0991 0.0773 0.1018 0.1004 0.1009 0.0922 0.1269 0.1291 0.1395 0.0896 0.0951 0.0956 0.0796 0.0959 0.1021 0.1020 0.0934 0.1025 0.0951 0.0810 0.0794 0.0815 0.0783
va: 2.0902 2.0184 2.0766 2.0720 3.1010 3.7247 3.7851 3.8316 3.8776 3.9135 3.8759 4.1304 3.7033 3.8903 3.9292 3.9412 3.7092 3.6159 3.9152 3.9170 3.9179 3.9172 4.1708 4.2002 1.0190 1.0293 1.0054 1.0119 1.0028 1.0014 0.9987 1.0010 1.0027 1.0105 1.0190 1.0066 0.9955 0.9963 1.0178 0.9990 0.9981 1.0043 1.0159 1.0056 1.0155 1.0094 1.0067 1.0092 1.0067
dispcorr: -0.025413725 hartree
energy: -1094.892364618890
dipole: -13.42233 14.70779 1.28546 -13.72728 12.05474 -1.67254 -12.27931 10.95147 -1.32784
magnitude: 2.49258 au
magnitude: 6.33564 debye
