program: Orca
programVersion: 5.0.2
elementType: O O O O N C C C C C C C C C C C C C C C C C C C H H H H H H H H H H H H H H H H H H H H H H H H H
charge: 0
multiplicity: 1
keywords: wb97x-d3
keywords: def2-TZVPP
keywords: def2/J RIJCOSX
keywords: DEFGRID2
keywords: scfconv7
keywords: smallprint printgap noloewdin
keywords: NOSOSCF
formula: C19H25NO4
InChI: InChI=1/C19H25NO4/c1-11(2)9-14-15(19(14,3)4)18(23)24-10-20-16(21)12-7-5-6-8-13(12)17(20)22/h9,14-15H,5-8,10H2,1-4H3
49 atoms
O  -0.639497 1.140173 1.3353
O  -1.520965 3.003223 0.453363
O  2.142528 -0.573087 2.257836
O  1.455139 2.655577 -0.855096
N  1.659221 1.302088 1.002274
C  -2.234453 -0.045638 -1.116964
C  -2.679018 -0.554004 0.225012
C  -2.567186 0.93655 -0.00391
C  -0.7991 -0.27307 -1.527676
C  -3.189849 -0.072694 -2.283907
C  -4.020936 -1.131833 0.445269
C  -1.541602 1.803938 0.603281
C  -4.29859 -2.298219 1.037079
C  0.552569 1.793387 1.758075
C  -5.718201 -2.749497 1.208301
C  -3.275434 -3.252773 1.572395
C  3.09789 -0.238114 0.061305
C  2.887697 0.705101 -0.858728
C  3.994024 -1.407718 -0.104365
C  3.488851 0.724593 -2.213588
C  4.886647 -1.193636 -1.32748
C  4.100004 -0.644564 -2.517175
C  2.27712 0.077954 1.252505
C  1.933145 1.694233 -0.306645
H  -1.880246 -0.991474 0.812627
H  -3.501008 1.46863 -0.153087
H  -0.131954 -0.427441 -0.681847
H  -0.735416 -1.167214 -2.150445
H  -0.419891 0.562757 -2.11935
H  -2.882284 0.647418 -3.044321
H  -3.193865 -1.060768 -2.748304
H  -4.213557 0.166455 -1.999601
H  -4.857681 -0.53563 0.092206
H  0.699372 1.549236 2.806577
H  0.485556 2.873516 1.65536
H  -6.43123 -2.028356 0.809412
H  -5.889187 -3.706247 0.708093
H  -5.953491 -2.908431 2.263866
H  -3.420929 -3.41402 2.643413
H  -3.387161 -4.231157 1.098412
H  -2.247385 -2.930016 1.420378
H  4.592554 -1.559225 0.796652
H  3.387346 -2.311375 -0.219787
H  2.734763 0.991015 -2.957646
H  4.250966 1.50876 -2.260182
H  5.687091 -0.494744 -1.069715
H  5.367221 -2.134544 -1.597251
H  3.301521 -1.344863 -2.777351
H  4.747437 -0.568688 -3.391245
elementType: O N C H
totalener: -1094.86839967 hartree
nucrepener: 2150.71909689 hartree
electener: -3245.58749656 hartree
oneelecener: -5763.13892313 hartree
twoeener: 2517.55142657 hartree
cpcmener: -0.04248208 hartree
kineticenergy: 1090.03906713 hartree
xcener: -105.973989224902 hartree
chargesum: -0.0000000
charge: -0.275765 -0.476615 -0.433259 -0.424910 -0.093148 0.114601 0.078277 -0.130238 -0.267401 -0.274476 -0.308846 0.422623 -0.044177 0.063517 -0.221980 -0.252944 -0.061817 -0.031657 -0.067599 -0.075526 -0.136259 -0.133675 0.342189 0.269621 0.100586 0.094603 0.070196 0.102622 0.101047 0.098744 0.096787 0.089540 0.121885 0.131566 0.136960 0.088865 0.094148 0.093713 0.096810 0.096185 0.089037 0.094606 0.102492 0.094866 0.104290 0.078066 0.081591 0.078923 0.081334
qa: -0.2758 -0.4766 -0.4333 -0.4249 -0.0931 0.1146 0.0783 -0.1302 -0.2674 -0.2745 -0.3088 0.4226 -0.0442 0.0635 -0.2220 -0.2529 -0.0618 -0.0317 -0.0676 -0.0755 -0.1363 -0.1337 0.3422 0.2696 0.1006 0.0946 0.0702 0.1026 0.1010 0.0987 0.0968 0.0895 0.1219 0.1316 0.1370 0.0889 0.0941 0.0937 0.0968 0.0962 0.0890 0.0946 0.1025 0.0949 0.1043 0.0781 0.0816 0.0789 0.0813
va: 2.1126 2.0220 2.0734 2.0742 3.1011 3.7031 3.7117 3.8529 3.9029 3.9067 3.8545 4.1677 3.7573 3.9031 3.9221 3.9426 3.6950 3.6014 3.9141 3.9122 3.9165 3.9134 4.1657 4.2024 1.0239 1.0327 1.0140 1.0026 1.0039 1.0013 1.0020 1.0055 1.0101 1.0081 1.0192 1.0086 0.9963 0.9959 0.9966 0.9973 1.0106 1.0146 1.0057 1.0149 1.0049 1.0067 1.0094 1.0077 1.0095
dispcorr: -0.025509669 hartree
energy: -1094.893909342741
dipole: -12.64179 13.88720 1.24541 -22.14856 19.86220 -2.28636 -11.52911 10.52046 -1.00865
magnitude: 2.79210 au
magnitude: 7.09696 debye
