program: Orca
programVersion: 5.0.2
elementType: O O O O N C C C C C C C C C C C C C C C C C C C H H H H H H H H H H H H H H H H H H H H H H H H H
charge: 0
multiplicity: 1
keywords: wb97x-d3
keywords: def2-TZVPP
keywords: def2/J RIJCOSX
keywords: DEFGRID2
keywords: scfconv7
keywords: smallprint printgap noloewdin
keywords: NOSOSCF
formula: C19H25NO4
InChI: InChI=1/C19H25NO4/c1-11(2)9-14-15(19(14,3)4)18(23)24-10-20-16(21)12-7-5-6-8-13(12)17(20)22/h9,14-15H,5-8,10H2,1-4H3
49 atoms
O  -0.376127 0.409924 -0.556836
O  -1.858548 0.96392 -2.1297
O  2.325996 2.412424 -0.101718
O  2.065297 -2.013165 -1.096519
N  1.899333 0.274413 -0.850859
C  -3.666928 1.543165 0.408306
C  -4.054058 0.254858 -0.226635
C  -2.594166 0.502612 0.105794
C  -3.75668 2.813873 -0.398824
C  -3.947157 1.752919 1.876417
C  -4.808131 -0.802025 0.496031
C  -1.618759 0.661188 -0.981467
C  -4.644471 -2.113698 0.30613
C  0.670259 0.507063 -1.522512
C  -5.4569 -3.121081 1.059386
C  -3.643832 -2.687168 -0.649445
C  3.785374 0.556693 0.440301
C  3.715018 -0.740435 0.136963
C  4.855219 1.187073 1.250152
C  4.711118 -1.764735 0.533177
C  5.665485 0.099506 1.957502
C  5.981335 -1.071945 1.029207
C  2.621079 1.245313 -0.165368
C  2.490706 -0.970768 -0.666574
H  -4.271707 0.330487 -1.289787
H  -2.20899 -0.013917 0.977501
H  -3.004058 3.537358 -0.080179
H  -3.640851 2.653003 -1.468263
H  -4.735612 3.271873 -0.245131
H  -4.968813 2.107904 2.025543
H  -3.821572 0.841994 2.461343
H  -3.27348 2.505946 2.288921
H  -5.557493 -0.469713 1.209238
H  0.689808 1.497706 -1.975016
H  0.541269 -0.238098 -2.306743
H  -6.143164 -2.652122 1.764148
H  -6.042647 -3.740893 0.37598
H  -4.811202 -3.80404 1.61728
H  -4.11661 -3.419978 -1.307536
H  -3.163081 -1.937549 -1.275538
H  -2.859727 -3.222776 -0.107269
H  5.496786 1.785585 0.595867
H  4.424601 1.88517 1.971591
H  4.285111 -2.401202 1.315074
H  4.929799 -2.425803 -0.308415
H  6.589332 0.529263 2.345803
H  5.101063 -0.264593 2.820387
H  6.615455 -1.796204 1.541332
H  6.55034 -0.707787 0.169454
elementType: O N C H
totalener: -1094.86999121 hartree
nucrepener: 2055.54751404 hartree
electener: -3150.41750524 hartree
oneelecener: -5573.19385800 hartree
twoeener: 2422.77635276 hartree
cpcmener: -0.03602175 hartree
kineticenergy: 1090.04372852 hartree
xcener: -105.973106213239 hartree
chargesum: 0.0000000
charge: -0.281308 -0.501906 -0.434281 -0.433888 -0.112289 0.149990 -0.013140 -0.093791 -0.278299 -0.284846 -0.301299 0.410354 -0.008814 0.086898 -0.228940 -0.246510 -0.069968 -0.073905 -0.069055 -0.072340 -0.134682 -0.135399 0.338930 0.342927 0.101814 0.094969 0.100696 0.091047 0.096963 0.100060 0.093456 0.098513 0.124244 0.131756 0.133735 0.090658 0.096691 0.094516 0.101244 0.081905 0.101945 0.101218 0.094033 0.102822 0.094023 0.080498 0.078914 0.081260 0.078583
qa: -0.2813 -0.5019 -0.4343 -0.4339 -0.1123 0.1500 -0.0131 -0.0938 -0.2783 -0.2848 -0.3013 0.4104 -0.0088 0.0869 -0.2289 -0.2465 -0.0700 -0.0739 -0.0691 -0.0723 -0.1347 -0.1354 0.3389 0.3429 0.1018 0.0950 0.1007 0.0910 0.0970 0.1001 0.0935 0.0985 0.1242 0.1318 0.1337 0.0907 0.0967 0.0945 0.1012 0.0819 0.1019 0.1012 0.0940 0.1028 0.0940 0.0805 0.0789 0.0813 0.0786
va: 2.1048 1.9934 2.0769 2.0775 3.1357 3.7062 3.8110 3.8327 3.8917 3.9101 3.8965 4.0921 3.7007 3.8856 3.9302 3.9378 3.6879 3.6920 3.9198 3.9208 3.9167 3.9159 4.1877 4.1854 1.0263 1.0291 0.9993 1.0172 1.0008 0.9995 1.0017 1.0029 1.0032 1.0026 1.0027 1.0059 0.9962 0.9963 0.9999 1.0141 0.9978 1.0047 1.0149 1.0046 1.0149 1.0093 1.0066 1.0094 1.0068
dispcorr: -0.022438411 hartree
energy: -1094.892429616102
dipole: -16.21992 17.70343 1.48351 -5.75610 5.09435 -0.66175 12.30877 -10.59493 1.71384
magnitude: 2.36135 au
magnitude: 6.00208 debye
