program: Orca
programVersion: 5.0.2
elementType: O O O O N C C C C C C C C C C C C C C C C C C C H H H H H H H H H H H H H H H H H H H H H H H H H
charge: 0
multiplicity: 1
keywords: wb97x-d3
keywords: def2-TZVPP
keywords: def2/J RIJCOSX
keywords: DEFGRID2
keywords: scfconv7
keywords: smallprint printgap noloewdin
keywords: NOSOSCF
formula: C19H25NO4
InChI: InChI=1/C19H25NO4/c1-11(2)9-14-15(19(14,3)4)18(23)24-10-20-16(21)12-7-5-6-8-13(12)17(20)22/h9,14-15H,5-8,10H2,1-4H3
49 atoms
O  -0.160811 0.153202 -0.568991
O  -1.711443 0.527007 -2.128653
O  2.331447 2.451216 -0.216797
O  2.478679 -2.017015 -1.01756
N  2.113275 0.256014 -0.885148
C  -3.421145 1.120762 0.481069
C  -3.83513 -0.173327 -0.15164
C  -2.368758 0.078704 0.13378
C  -3.541923 2.386435 -0.330317
C  -3.662057 1.342762 1.954081
C  -4.537348 -1.234985 0.597223
C  -1.425902 0.277083 -0.978974
C  -5.654537 -1.867772 0.223118
C  0.861258 0.340533 -1.54887
C  -6.258485 -2.928894 1.093679
C  -6.408132 -1.60068 -1.043704
C  3.946226 0.761006 0.415303
C  3.993867 -0.549907 0.172679
C  4.94684 1.521622 1.201533
C  5.071214 -1.462028 0.626442
C  5.847997 0.545997 1.960221
C  6.272292 -0.635245 1.088722
C  2.733143 1.31512 -0.230743
C  2.80706 -0.922991 -0.633345
H  -4.103031 -0.079779 -1.198747
H  -1.94763 -0.437136 0.98979
H  -3.477452 2.219106 -1.403226
H  -4.509085 2.852832 -0.133716
H  -2.769703 3.106006 -0.051392
H  -3.491479 0.449209 2.552826
H  -3.000206 2.1234 2.333423
H  -4.689579 1.669269 2.126093
H  -4.093764 -1.518273 1.547368
H  0.77013 1.317705 -2.021416
H  0.805251 -0.431473 -2.315738
H  -7.278104 -2.662673 1.384322
H  -6.329412 -3.880275 0.560261
H  -5.681301 -3.094611 2.003133
H  -5.948312 -0.848035 -1.68067
H  -6.51189 -2.516971 -1.630027
H  -7.423699 -1.265536 -0.818156
H  5.535809 2.146946 0.523196
H  4.447759 2.208874 1.888433
H  4.695789 -2.089902 1.440548
H  5.352696 -2.145744 -0.177507
H  6.727491 1.074856 2.328734
H  5.314044 0.173234 2.838546
H  6.966348 -1.274433 1.635365
H  6.810485 -0.263429 0.212492
elementType: O N C H
totalener: -1094.87169946 hartree
nucrepener: 2026.45477434 hartree
electener: -3121.32647381 hartree
oneelecener: -5514.98951838 hartree
twoeener: 2393.66304458 hartree
cpcmener: -0.03744706 hartree
kineticenergy: 1090.03904277 hartree
xcener: -105.972918417485 hartree
chargesum: 0.0000000
charge: -0.277609 -0.497002 -0.433539 -0.433352 -0.115401 0.104688 0.044496 -0.097595 -0.276676 -0.267128 -0.284337 0.419237 -0.049737 0.088854 -0.218732 -0.251431 -0.068935 -0.070442 -0.068925 -0.074408 -0.135751 -0.134875 0.337387 0.341558 0.091414 0.092100 0.090860 0.098187 0.100705 0.088814 0.098770 0.098095 0.122577 0.131475 0.134542 0.093345 0.093845 0.088889 0.090860 0.095493 0.096856 0.101582 0.094339 0.102434 0.094257 0.081276 0.078914 0.081172 0.078852
qa: -0.2776 -0.4970 -0.4335 -0.4334 -0.1154 0.1047 0.0445 -0.0976 -0.2767 -0.2671 -0.2843 0.4192 -0.0497 0.0889 -0.2187 -0.2514 -0.0689 -0.0704 -0.0689 -0.0744 -0.1358 -0.1349 0.3374 0.3416 0.0914 0.0921 0.0909 0.0982 0.1007 0.0888 0.0988 0.0981 0.1226 0.1315 0.1345 0.0933 0.0938 0.0889 0.0909 0.0955 0.0969 0.1016 0.0943 0.1024 0.0943 0.0813 0.0789 0.0812 0.0789
va: 2.1142 2.0029 2.0773 2.0780 3.1379 3.7004 3.7604 3.8731 3.9051 3.9083 3.8678 4.1193 3.7570 3.8830 3.9202 3.9415 3.6875 3.6882 3.9190 3.9208 3.9170 3.9150 4.1884 4.1873 1.0338 1.0343 1.0175 1.0001 0.9995 1.0058 1.0020 1.0017 1.0092 1.0034 1.0012 0.9962 0.9963 1.0086 1.0095 0.9970 0.9970 1.0045 1.0150 1.0048 1.0147 1.0092 1.0065 1.0095 1.0068
dispcorr: -0.021528130 hartree
energy: -1094.893227592667
dipole: -22.08278 23.40025 1.31747 -2.80945 2.62292 -0.18653 12.20261 -10.48232 1.72030
magnitude: 2.17484 au
magnitude: 5.52801 debye
