program: Orca
programVersion: 5.0.2
elementType: O O O O N C C C C C C C C C C C C C C C C C C C H H H H H H H H H H H H H H H H H H H H H H H H H
charge: 0
multiplicity: 1
keywords: wb97x-d3
keywords: def2-TZVPP
keywords: def2/J RIJCOSX
keywords: DEFGRID2
keywords: scfconv7
keywords: smallprint printgap noloewdin
keywords: NOSOSCF
formula: C19H25NO4
InChI: InChI=1/C19H25NO4/c1-11(2)9-14-15(19(14,3)4)18(23)24-10-20-16(21)12-7-5-6-8-13(12)17(20)22/h9,14-15H,5-8,10H2,1-4H3
49 atoms
O  -0.208916 1.356733 -0.073831
O  -1.509009 1.136161 -1.888145
O  3.080023 2.64506 0.931804
O  1.595316 -0.839471 -1.574769
N  2.061417 1.131686 -0.481427
C  -3.727817 0.93099 0.356991
C  -3.461747 -0.404148 -0.264781
C  -2.299171 0.410402 0.249823
C  -4.209569 2.057254 -0.521931
C  -4.297882 0.978472 1.752581
C  -3.812672 -1.679865 0.408297
C  -1.33566 0.988286 -0.701291
C  -4.916421 -2.389131 0.157041
C  0.884913 1.850724 -0.83908
C  -5.185899 -3.685972 0.856412
C  -5.963647 -1.966632 -0.827535
C  4.018862 0.44968 0.52065
C  3.586134 -0.574154 -0.217169
C  5.264009 0.454093 1.326566
C  4.283172 -1.874315 -0.366613
C  5.789173 -0.976483 1.462573
C  5.719883 -1.740843 0.140882
C  3.046937 1.564761 0.397839
C  2.309396 -0.181549 -0.8592
H  -3.554308 -0.410316 -1.347159
H  -1.864769 0.092589 1.191528
H  -3.876892 3.024819 -0.141416
H  -3.880323 1.968585 -1.554764
H  -5.301189 2.067467 -0.529716
H  -3.893456 0.199614 2.397728
H  -4.088324 1.941384 2.221441
H  -5.382212 0.85434 1.722685
H  -3.113134 -2.055241 1.14969
H  1.028963 2.903235 -0.60449
H  0.701082 1.750734 -1.906186
H  -6.122776 -3.640966 1.417375
H  -5.295995 -4.502209 0.137822
H  -4.388469 -3.952993 1.549502
H  -5.791151 -0.974574 -1.241922
H  -6.023355 -2.673314 -1.65956
H  -6.950149 -1.962837 -0.357716
H  6.005169 1.094092 0.837596
H  5.082349 0.898809 2.30751
H  3.74221 -2.639593 0.198841
H  4.264262 -2.19932 -1.409124
H  6.816198 -0.95342 1.82777
H  5.199351 -1.505142 2.216168
H  6.158842 -2.732022 0.258361
H  6.318466 -1.219183 -0.610796
elementType: O N C H
totalener: -1094.86887887 hartree
nucrepener: 2045.85225529 hartree
electener: -3140.72113416 hartree
oneelecener: -5554.06263319 hartree
twoeener: 2413.34149903 hartree
cpcmener: -0.03802016 hartree
kineticenergy: 1090.03760883 hartree
xcener: -105.972785433343 hartree
chargesum: -0.0000000
charge: -0.285463 -0.485932 -0.434782 -0.438332 -0.097642 0.138382 -0.006410 -0.145024 -0.294477 -0.268315 -0.263235 0.443032 -0.036724 0.078776 -0.229930 -0.252110 -0.082171 -0.056927 -0.070382 -0.073439 -0.135561 -0.135003 0.343062 0.338316 0.098601 0.097090 0.102805 0.093210 0.097501 0.093123 0.100287 0.097227 0.124559 0.128010 0.140998 0.094963 0.094851 0.089952 0.088387 0.102052 0.095489 0.102268 0.093996 0.102646 0.093229 0.080476 0.078581 0.081038 0.078952
qa: -0.2855 -0.4859 -0.4348 -0.4383 -0.0976 0.1384 -0.0064 -0.1450 -0.2945 -0.2683 -0.2632 0.4430 -0.0367 0.0788 -0.2299 -0.2521 -0.0822 -0.0569 -0.0704 -0.0734 -0.1356 -0.1350 0.3431 0.3383 0.0986 0.0971 0.1028 0.0932 0.0975 0.0931 0.1003 0.0972 0.1246 0.1280 0.1410 0.0950 0.0949 0.0900 0.0884 0.1021 0.0955 0.1023 0.0940 0.1026 0.0932 0.0805 0.0786 0.0810 0.0790
va: 2.1074 2.0217 2.0771 2.0727 3.1101 3.6771 3.7793 3.8748 3.9024 3.9063 3.8653 4.1518 3.7007 3.8483 3.9273 3.9404 3.7151 3.6744 3.9172 3.9203 3.9182 3.9153 4.1979 4.1945 1.0255 1.0361 0.9997 1.0168 1.0004 1.0020 1.0029 1.0018 1.0064 1.0128 1.0172 0.9961 0.9950 1.0076 1.0071 0.9977 0.9981 1.0044 1.0153 1.0045 1.0152 1.0095 1.0065 1.0094 1.0066
dispcorr: -0.022389296 hartree
energy: -1094.891268163208
dipole: -22.66086 23.66407 1.00321 -13.67670 12.71055 -0.96615 7.80536 -6.45629 1.34908
magnitude: 1.93904 au
magnitude: 4.92866 debye
