program: Orca
programVersion: 5.0.2
elementType: O O O O N C C C C C C C C C C C C C C C C C C C H H H H H H H H H H H H H H H H H H H H H H H H H
charge: 0
multiplicity: 1
keywords: wb97x-d3
keywords: def2-TZVPP
keywords: def2/J RIJCOSX
keywords: DEFGRID2
keywords: scfconv7
keywords: smallprint printgap noloewdin
keywords: NOSOSCF
formula: C19H25NO4
InChI: InChI=1/C19H25NO4/c1-11(2)9-14-15(19(14,3)4)18(23)24-10-20-16(21)12-7-5-6-8-13(12)17(20)22/h9,14-15H,5-8,10H2,1-4H3
49 atoms
O  -0.293726 1.330362 0.61128
O  -1.492887 1.988835 -1.167655
O  1.65085 0.20281 -1.744635
O  2.812583 1.75344 2.361532
N  1.994631 1.29619 0.252053
C  -3.779613 0.732776 0.66678
C  -3.518751 -0.103344 -0.54973
C  -2.356018 0.324664 0.321332
C  -4.230406 2.158852 0.468487
C  -4.360661 0.095981 1.904869
C  -3.854513 -1.539334 -0.628143
C  -1.372908 1.296105 -0.18512
C  -4.493937 -2.148387 -1.632113
C  0.831475 2.118503 0.237866
C  -4.735416 -3.627886 -1.602104
C  -5.012273 -1.458871 -2.857741
C  3.468809 -0.398713 -0.259766
C  3.807941 0.058183 0.946989
C  4.17435 -1.476063 -0.994898
C  4.940671 -0.444659 1.761137
C  5.533991 -1.729477 -0.342141
C  5.435357 -1.771543 1.182116
C  2.27984 0.351484 -0.726616
C  2.856922 1.130581 1.330397
H  -3.597416 0.44678 -1.48106
H  -1.937966 -0.434704 0.97299
H  -3.901103 2.58532 -0.476865
H  -5.320929 2.201538 0.480343
H  -3.869219 2.800392 1.274498
H  -3.974018 -0.905653 2.08762
H  -4.135086 0.701055 2.784767
H  -5.446981 0.025155 1.822604
H  -3.529379 -2.151118 0.208463
H  0.95248 2.91836 0.965092
H  0.703632 2.557768 -0.74868
H  -4.291927 -4.113269 -2.475498
H  -4.319672 -4.095802 -0.710128
H  -5.804448 -3.852699 -1.635897
H  -4.981668 -0.372966 -2.798957
H  -4.443515 -1.761398 -3.740774
H  -6.048065 -1.749167 -3.04708
H  3.561157 -2.38251 -0.979258
H  4.289232 -1.207509 -2.047367
H  5.741758 0.30128 1.760518
H  4.63809 -0.561468 2.804139
H  5.949589 -2.665611 -0.716327
H  6.227263 -0.937449 -0.638471
H  6.406408 -2.016525 1.613553
H  4.749165 -2.569748 1.477844
elementType: O N C H
totalener: -1094.87013067 hartree
nucrepener: 2052.12531062 hartree
electener: -3146.99544129 hartree
oneelecener: -5566.60830046 hartree
twoeener: 2419.61285918 hartree
cpcmener: -0.03888404 hartree
kineticenergy: 1090.03902465 hartree
xcener: -105.973613120198 hartree
chargesum: -0.0000000
charge: -0.282500 -0.484342 -0.436346 -0.434118 -0.107009 0.106211 0.049597 -0.133468 -0.273606 -0.267888 -0.292105 0.437692 -0.040132 0.081676 -0.219708 -0.258543 -0.056999 -0.076247 -0.073687 -0.070497 -0.133925 -0.135274 0.337768 0.340982 0.088967 0.095616 0.090451 0.097755 0.100614 0.089924 0.098272 0.097974 0.121539 0.128538 0.138867 0.093347 0.088830 0.094298 0.091885 0.100736 0.094052 0.102870 0.093881 0.101776 0.093857 0.080705 0.078114 0.081120 0.078481
qa: -0.2825 -0.4843 -0.4363 -0.4341 -0.1070 0.1062 0.0496 -0.1335 -0.2736 -0.2679 -0.2921 0.4377 -0.0401 0.0817 -0.2197 -0.2585 -0.0570 -0.0762 -0.0737 -0.0705 -0.1339 -0.1353 0.3378 0.3410 0.0890 0.0956 0.0905 0.0978 0.1006 0.0899 0.0983 0.0980 0.1215 0.1285 0.1389 0.0933 0.0888 0.0943 0.0919 0.1007 0.0941 0.1029 0.0939 0.1018 0.0939 0.0807 0.0781 0.0811 0.0785
va: 2.1066 2.0246 2.0748 2.0767 3.1161 3.7034 3.7573 3.8276 3.9091 3.9078 3.8825 4.1508 3.7463 3.8553 3.9220 3.9431 3.6717 3.7063 3.9201 3.9166 3.9155 3.9172 4.1962 4.1986 1.0344 1.0364 1.0165 1.0003 0.9995 1.0053 1.0020 1.0017 1.0102 1.0109 1.0193 0.9952 1.0088 0.9966 1.0078 0.9956 0.9978 1.0046 1.0149 1.0043 1.0154 1.0095 1.0067 1.0095 1.0067
dispcorr: -0.021860295 hartree
energy: -1094.891990961743
dipole: -20.63131 21.69032 1.05901 -16.65209 15.05911 -1.59297 -2.31139 3.05861 0.74722
magnitude: 2.05363 au
magnitude: 5.21992 debye
