program: Orca
programVersion: 5.0.2
elementType: O O O O N C C C C C C C C C C C C C C C C C C C H H H H H H H H H H H H H H H H H H H H H H H H H
charge: 0
multiplicity: 1
keywords: wb97x-d3
keywords: def2-TZVPP
keywords: def2/J RIJCOSX
keywords: DEFGRID2
keywords: scfconv7
keywords: smallprint printgap noloewdin
keywords: NOSOSCF
formula: C19H25NO4
InChI: InChI=1/C19H25NO4/c1-11(2)9-14-15(19(14,3)4)18(23)24-10-20-16(21)12-7-5-6-8-13(12)17(20)22/h9,14-15H,5-8,10H2,1-4H3
49 atoms
O  -0.499155 -0.532734 1.217473
O  -0.449501 1.699792 1.224026
O  1.811252 -1.879616 -0.432337
O  2.468533 1.75146 2.226298
N  1.846198 -0.189613 1.134028
C  -2.53091 -0.225795 -1.066026
C  -3.233035 -0.538735 0.217942
C  -2.269567 0.625471 0.170451
C  -1.502998 -1.19764 -1.590957
C  -3.307818 0.458192 -2.163683
C  -4.680306 -0.269314 0.413423
C  -0.997502 0.667092 0.910158
C  -5.646806 -1.16934 0.21627
C  0.73188 -0.606481 1.924296
C  -7.087722 -0.833896 0.449087
C  -5.385688 -2.566917 -0.25385
C  3.362416 -0.0273 -0.594274
C  3.547686 1.039344 0.184394
C  4.140746 -0.336037 -1.817864
C  4.555466 2.101967 -0.047052
C  5.39769 0.535666 -1.854264
C  5.100167 1.984774 -1.471657
C  2.267836 -0.843042 -0.017332
C  2.586382 0.975857 1.311897
H  -2.855215 -1.423485 0.721296
H  -2.727728 1.608063 0.130897
H  -1.972363 -1.839881 -2.33876
H  -0.675791 -0.679838 -2.080266
H  -1.094655 -1.848786 -0.822627
H  -2.630728 0.942744 -2.869529
H  -3.898606 -0.272908 -2.719621
H  -3.991727 1.217013 -1.784655
H  -4.95806 0.730213 0.735378
H  0.833257 -1.655085 2.19067
H  0.70528 -0.015353 2.838439
H  -7.675487 -0.98216 -0.460382
H  -7.524582 -1.488329 1.207812
H  -7.222825 0.197153 0.775237
H  -4.330554 -2.776425 -0.421854
H  -5.763908 -3.297255 0.465959
H  -5.915165 -2.758754 -1.190667
H  4.399072 -1.396789 -1.848406
H  3.515864 -0.151628 -2.697416
H  4.116359 3.087352 0.123997
H  5.361446 1.998635 0.686328
H  6.139445 0.124374 -1.164101
H  5.839831 0.495502 -2.850293
H  4.36863 2.399982 -2.170306
H  6.002682 2.589297 -1.567204
elementType: O N C H
totalener: -1094.86697802 hartree
nucrepener: 2111.11762827 hartree
electener: -3205.98460629 hartree
oneelecener: -5684.75335514 hartree
twoeener: 2478.76874885 hartree
cpcmener: -0.04113393 hartree
kineticenergy: 1090.04714368 hartree
xcener: -105.975773250739 hartree
chargesum: -0.0000000
charge: -0.271630 -0.489015 -0.438690 -0.428956 -0.090381 0.157450 0.023737 -0.164454 -0.319036 -0.273332 -0.285300 0.450563 -0.033228 0.064249 -0.230145 -0.251020 -0.054736 -0.069866 -0.073029 -0.074463 -0.136135 -0.136017 0.322652 0.331697 0.111066 0.092784 0.100129 0.107323 0.086326 0.101594 0.096217 0.093018 0.123544 0.141789 0.137386 0.094319 0.095565 0.090347 0.087144 0.101101 0.097294 0.093320 0.102830 0.093767 0.102379 0.078614 0.080943 0.078936 0.081354
qa: -0.2716 -0.4890 -0.4387 -0.4290 -0.0904 0.1575 0.0237 -0.1645 -0.3190 -0.2733 -0.2853 0.4506 -0.0332 0.0642 -0.2301 -0.2510 -0.0547 -0.0699 -0.0730 -0.0745 -0.1361 -0.1360 0.3227 0.3317 0.1111 0.0928 0.1001 0.1073 0.0863 0.1016 0.0962 0.0930 0.1235 0.1418 0.1374 0.0943 0.0956 0.0903 0.0871 0.1011 0.0973 0.0933 0.1028 0.0938 0.1024 0.0786 0.0809 0.0789 0.0814
va: 2.1054 2.0170 2.0680 2.0792 3.0826 3.6163 3.7614 3.9162 3.9008 3.9095 3.8482 4.1522 3.7066 3.9065 3.9279 3.9409 3.7094 3.6774 3.9155 3.9146 3.9167 3.9175 4.1630 4.1863 1.0137 1.0328 1.0025 0.9990 1.0202 1.0019 1.0010 1.0025 1.0071 0.9987 1.0126 0.9962 0.9953 1.0071 1.0079 0.9989 0.9977 1.0159 1.0043 1.0155 1.0043 1.0063 1.0093 1.0063 1.0094
dispcorr: -0.024611860 hartree
energy: -1094.891589881484
dipole: -20.36442 20.78744 0.42302 -5.28738 4.36012 -0.92726 -16.36633 14.92733 -1.43899
magnitude: 1.76337 au
magnitude: 4.48212 debye
