program: Orca
programVersion: 5.0.2
elementType: O O O O N C C C C C C C C C C C C C C C C C C C H H H H H H H H H H H H H H H H H H H H H H H H H
charge: 0
multiplicity: 1
keywords: wb97x-d3
keywords: def2-TZVPP
keywords: def2/J RIJCOSX
keywords: DEFGRID2
keywords: scfconv7
keywords: smallprint printgap noloewdin
keywords: NOSOSCF
formula: C19H25NO4
InChI: InChI=1/C19H25NO4/c1-11(2)9-14-15(19(14,3)4)18(23)24-10-20-16(21)12-7-5-6-8-13(12)17(20)22/h9,14-15H,5-8,10H2,1-4H3
49 atoms
O  -0.133839 -1.208298 0.403971
O  -1.324771 -1.766526 -1.411465
O  1.545668 0.343713 -1.757015
O  3.198195 -1.764608 1.909472
N  2.132185 -1.015549 0.005011
C  -2.747433 0.947783 -0.705257
C  -3.626216 -0.208343 -0.333622
C  -2.19003 -0.177643 0.152673
C  -2.31585 1.091333 -2.144746
C  -2.921032 2.27838 -0.013505
C  -4.720486 -0.102044 0.648778
C  -1.209258 -1.130433 -0.393569
C  -5.911215 -0.699068 0.541198
C  1.019621 -1.905155 -0.049655
C  -6.960485 -0.520508 1.595385
C  -6.293901 -1.569238 -0.627028
C  3.465504 0.826897 -0.358432
C  3.95312 0.200699 0.713489
C  4.024945 2.063893 -0.954908
C  5.156295 0.62158 1.472187
C  5.027526 2.690249 0.016748
C  5.943085 1.642666 0.648358
C  2.275658 0.080542 -0.835607
C  3.097595 -0.977825 1.004341
H  -3.80047 -0.905371 -1.147048
H  -2.037441 0.079184 1.195312
H  -1.310678 1.513165 -2.212978
H  -2.324367 0.152176 -2.69302
H  -2.993093 1.774455 -2.661278
H  -3.130253 2.185026 1.051365
H  -2.015619 2.879841 -0.116169
H  -3.741759 2.839445 -0.465645
H  -4.530069 0.506668 1.5275
H  0.886562 -2.277937 -1.063167
H  1.20685 -2.746012 0.615219
H  -7.876229 -0.099215 1.171209
H  -7.240959 -1.480664 2.037339
H  -6.629849 0.136249 2.400361
H  -6.401936 -0.990341 -1.546824
H  -5.556183 -2.348394 -0.825101
H  -7.247513 -2.067133 -0.451629
H  4.5064 1.819907 -1.907097
H  3.223265 2.765767 -1.196167
H  4.848297 1.05147 2.430516
H  5.77486 -0.244724 1.716908
H  5.621562 3.44115 -0.506019
H  4.483425 3.216977 0.805659
H  6.686993 2.127608 1.281792
H  6.494832 1.121556 -0.139111
elementType: O N C H
totalener: -1094.87858591 hartree
nucrepener: 2065.23271302 hartree
electener: -3160.11129893 hartree
oneelecener: -5592.80217475 hartree
twoeener: 2432.69087581 hartree
cpcmener: -0.03047026 hartree
kineticenergy: 1090.04626450 hartree
xcener: -105.972127386664 hartree
chargesum: -0.0000000
charge: -0.283099 -0.455348 -0.414337 -0.408671 -0.097916 0.102840 0.044079 -0.087133 -0.275373 -0.275910 -0.298684 0.384669 -0.009534 0.082803 -0.222514 -0.285994 -0.054013 -0.080828 -0.071528 -0.075714 -0.136765 -0.133938 0.311735 0.324666 0.091848 0.089635 0.092770 0.094835 0.097199 0.088979 0.097071 0.098100 0.114554 0.140604 0.124255 0.097661 0.095214 0.083890 0.107350 0.100538 0.094463 0.101063 0.093865 0.101581 0.093113 0.080914 0.078179 0.081133 0.077693
qa: -0.2831 -0.4553 -0.4143 -0.4087 -0.0979 0.1028 0.0441 -0.0871 -0.2754 -0.2759 -0.2987 0.3847 -0.0095 0.0828 -0.2225 -0.2860 -0.0540 -0.0808 -0.0715 -0.0757 -0.1368 -0.1339 0.3117 0.3247 0.0918 0.0896 0.0928 0.0948 0.0972 0.0890 0.0971 0.0981 0.1146 0.1406 0.1243 0.0977 0.0952 0.0839 0.1073 0.1005 0.0945 0.1011 0.0939 0.1016 0.0931 0.0809 0.0782 0.0811 0.0777
va: 2.1053 2.0541 2.0983 2.1099 3.0960 3.7019 3.7840 3.8254 3.9018 3.9139 3.9068 4.1905 3.6992 3.8557 3.9208 3.9396 3.6578 3.6948 3.9185 3.9193 3.9155 3.9125 4.2152 4.2228 1.0270 1.0347 1.0067 1.0177 1.0013 1.0064 1.0016 1.0010 1.0113 1.0167 1.0141 0.9925 0.9932 1.0105 0.9942 0.9985 1.0043 1.0049 1.0154 1.0052 1.0159 1.0095 1.0067 1.0098 1.0069
dispcorr: -0.022532717 hartree
energy: -1094.901118627349
dipole: -21.60712 22.64753 1.04041 14.06051 -12.41958 1.64093 0.02702 0.62079 0.64781
magnitude: 2.04811 au
magnitude: 5.20589 debye
