program: Orca
programVersion: 5.0.2
elementType: O O O O N C C C C C C C C C C C C C C C C C C C H H H H H H H H H H H H H H H H H H H H H H H H H
charge: 0
multiplicity: 1
keywords: wb97x-d3
keywords: def2-TZVPP
keywords: def2/J RIJCOSX
keywords: DEFGRID2
keywords: scfconv7
keywords: smallprint printgap noloewdin
keywords: NOSOSCF
formula: C19H25NO4
InChI: InChI=1/C19H25NO4/c1-11(2)9-14-15(19(14,3)4)18(23)24-10-20-16(21)12-7-5-6-8-13(12)17(20)22/h9,14-15H,5-8,10H2,1-4H3
49 atoms
O  -0.176566 -0.925577 1.010339
O  -1.1720 -2.15215 -0.584623
O  1.665495 -0.703821 -1.626614
O  3.02425 -0.466935 2.701129
N  2.110679 -0.895052 0.625079
C  -2.638379 0.58936 -1.079435
C  -3.560992 -0.374477 -0.39526
C  -2.182342 -0.125131 0.183815
C  -2.066067 0.206189 -2.422414
C  -2.871403 2.074674 -0.945718
C  -4.743725 0.062918 0.372242
C  -1.159283 -1.183032 0.132341
C  -5.967706 -0.474199 0.333279
C  1.00409 -1.716471 0.992441
C  -7.070034 0.077069 1.187817
C  -6.369844 -1.635992 -0.523367
C  3.481186 0.511368 -0.578884
C  3.881774 0.575206 0.691683
C  4.091912 1.255947 -1.706635
C  5.023179 1.382786 1.187091
C  5.015343 2.346528 -1.158694
C  5.873705 1.840803 0.00066
C  2.323412 -0.412745 -0.660481
C  2.998438 -0.29304 1.510314
H  -3.65559 -1.326677 -0.905964
H  -2.13517 0.503891 1.066163
H  -2.015492 -0.868853 -2.579502
H  -2.693169 0.619722 -3.214966
H  -1.061209 0.613613 -2.554368
H  -1.95277 2.62433 -1.160484
H  -3.629021 2.40827 -1.658008
H  -3.200723 2.368388 0.050041
H  -4.589557 0.903813 1.042273
H  0.914871 -2.554785 0.304976
H  1.169905 -2.099229 1.997153
H  -7.478118 -0.693534 1.847696
H  -6.735416 0.907598 1.809606
H  -7.904313 0.430524 0.575591
H  -5.580968 -1.994701 -1.181397
H  -6.692991 -2.47718 0.096059
H  -7.225622 -1.371726 -1.149996
H  4.647504 0.557629 -2.341092
H  3.314618 1.685039 -2.343617
H  4.642185 2.242642 1.747737
H  5.620207 0.803385 1.895489
H  5.652675 2.722165 -1.960488
H  4.410796 3.192067 -0.818279
H  6.562142 2.622499 0.324909
H  6.490098 1.00465 -0.342142
elementType: O N C H
totalener: -1094.88001335 hartree
nucrepener: 2068.17504661 hartree
electener: -3163.05505997 hartree
oneelecener: -5598.72496445 hartree
twoeener: 2435.66990449 hartree
cpcmener: -0.03176041 hartree
kineticenergy: 1090.03246350 hartree
xcener: -105.969984943318 hartree
chargesum: -0.0000000
charge: -0.282303 -0.452557 -0.411232 -0.408835 -0.096508 0.105718 0.038451 -0.095097 -0.277460 -0.268062 -0.274684 0.390670 -0.049586 0.079592 -0.218278 -0.251884 -0.058315 -0.082354 -0.073663 -0.074103 -0.135613 -0.136520 0.313439 0.325735 0.092719 0.089271 0.095109 0.097630 0.092689 0.096944 0.097380 0.087197 0.115811 0.140006 0.124957 0.092605 0.087731 0.093241 0.090173 0.096776 0.094014 0.100472 0.094189 0.102021 0.093327 0.081216 0.078662 0.080848 0.078458
qa: -0.2823 -0.4526 -0.4112 -0.4088 -0.0965 0.1057 0.0385 -0.0951 -0.2775 -0.2681 -0.2747 0.3907 -0.0496 0.0796 -0.2183 -0.2519 -0.0583 -0.0824 -0.0737 -0.0741 -0.1356 -0.1365 0.3134 0.3257 0.0927 0.0893 0.0951 0.0976 0.0927 0.0969 0.0974 0.0872 0.1158 0.1400 0.1250 0.0926 0.0877 0.0932 0.0902 0.0968 0.0940 0.1005 0.0942 0.1020 0.0933 0.0812 0.0787 0.0808 0.0785
va: 2.1107 2.0583 2.1016 2.1097 3.0945 3.6913 3.7813 3.8209 3.8994 3.9090 3.8767 4.1871 3.7654 3.8662 3.9214 3.9416 3.6581 3.6910 3.9204 3.9190 3.9143 3.9139 4.2162 4.2231 1.0316 1.0359 1.0177 1.0016 1.0065 1.0018 1.0018 1.0066 1.0119 1.0166 1.0141 0.9961 1.0091 0.9964 1.0103 0.9966 0.9975 1.0049 1.0154 1.0048 1.0157 1.0095 1.0065 1.0096 1.0065
dispcorr: -0.022569620 hartree
energy: -1094.902582971575
dipole: -21.66383 22.62135 0.95752 12.74627 -11.01877 1.72750 -8.03693 7.94500 -0.09193
magnitude: 1.97726 au
magnitude: 5.02579 debye
