program: Orca
programVersion: 5.0.2
elementType: O O O O N C C C C C C C C C C C C C C C C C C C H H H H H H H H H H H H H H H H H H H H H H H H H
charge: 0
multiplicity: 1
keywords: wb97x-d3
keywords: def2-TZVPP
keywords: def2/J RIJCOSX
keywords: DEFGRID2
keywords: scfconv7
keywords: smallprint printgap noloewdin
keywords: NOSOSCF
formula: C19H25NO4
InChI: InChI=1/C19H25NO4/c1-11(2)9-14-15(19(14,3)4)18(23)24-10-20-16(21)12-7-5-6-8-13(12)17(20)22/h9,14-15H,5-8,10H2,1-4H3
49 atoms
O  -0.609843 1.56631 1.392669
O  -0.302495 -0.647563 1.324351
O  2.682856 -0.377379 2.144904
O  1.212792 2.82231 -0.731716
N  1.708203 1.369066 0.986356
C  -2.396537 0.061114 -1.066326
C  -2.858449 -0.989039 -0.102597
C  -2.305285 0.312326 0.429235
C  -1.136057 -0.194895 -1.857735
C  -3.403991 0.900637 -1.811923
C  -4.281017 -1.352096 0.091292
C  -0.987734 0.317642 1.093337
C  -4.720994 -2.287141 0.938813
C  0.69717 1.770443 1.912293
C  -6.176837 -2.630755 1.030405
C  -3.829717 -3.071704 1.853122
C  3.254747 0.098471 -0.154365
C  2.828666 1.038008 -0.999167
C  4.269671 -0.936255 -0.468131
C  3.275577 1.18694 -2.405519
C  4.984298 -0.572159 -1.770667
C  4.007803 -0.084006 -2.840047
C  2.54931 0.269564 1.140101
C  1.828043 1.880814 -0.299562
H  -2.164979 -1.818196 -0.003395
H  -3.008656 1.04363 0.814008
H  -0.631017 0.742605 -2.101515
H  -0.42492 -0.834707 -1.336142
H  -1.381213 -0.688238 -2.800466
H  -2.949058 1.838911 -2.135389
H  -3.757147 0.380958 -2.70524
H  -4.27467 1.155749 -1.208116
H  -5.013871 -0.829575 -0.516252
H  0.848491 1.234344 2.84934
H  0.755615 2.838952 2.105041
H  -6.561739 -2.450224 2.037702
H  -6.782258 -2.055158 0.330111
H  -6.342564 -3.691777 0.823955
H  -3.80546 -4.126425 1.565051
H  -2.803135 -2.709575 1.879608
H  -4.213105 -3.042972 2.876128
H  4.981429 -1.033411 0.355151
H  3.775634 -1.909427 -0.554523
H  2.420667 1.388072 -3.055525
H  3.929992 2.060492 -2.489085
H  5.721535 0.210438 -1.569859
H  5.539351 -1.43707 -2.136533
H  3.273355 -0.868384 -3.045086
H  4.537476 0.100132 -3.775761
elementType: O N C H
totalener: -1094.87738254 hartree
nucrepener: 2147.60305506 hartree
electener: -3242.48043759 hartree
oneelecener: -5757.71969968 hartree
twoeener: 2515.23926209 hartree
cpcmener: -0.03170041 hartree
kineticenergy: 1090.04532338 hartree
xcener: -105.972235234950 hartree
chargesum: 0.0000000
charge: -0.275808 -0.450986 -0.400408 -0.407884 -0.097432 0.153934 -0.052140 -0.068539 -0.275327 -0.301475 -0.258156 0.382013 -0.024800 0.084063 -0.232016 -0.256472 -0.031667 -0.090343 -0.067450 -0.080453 -0.138534 -0.133930 0.296767 0.294030 0.100036 0.099420 0.091620 0.090792 0.104673 0.099987 0.103786 0.088328 0.120592 0.133445 0.142597 0.094261 0.087652 0.093320 0.098676 0.081458 0.093342 0.093418 0.100953 0.093130 0.102539 0.077622 0.081443 0.079199 0.080723
qa: -0.2758 -0.4510 -0.4004 -0.4079 -0.0974 0.1539 -0.0521 -0.0685 -0.2753 -0.3015 -0.2582 0.3820 -0.0248 0.0841 -0.2320 -0.2565 -0.0317 -0.0903 -0.0675 -0.0805 -0.1385 -0.1339 0.2968 0.2940 0.1000 0.0994 0.0916 0.0908 0.1047 0.1000 0.1038 0.0883 0.1206 0.1334 0.1426 0.0943 0.0877 0.0933 0.0987 0.0815 0.0933 0.0934 0.1010 0.0931 0.1025 0.0776 0.0814 0.0792 0.0807
va: 2.1197 2.0474 2.1156 2.1015 3.0659 3.7620 3.8403 3.8032 3.8824 3.9087 3.8922 4.2032 3.7195 3.8939 3.9310 3.9426 3.6152 3.6869 3.9090 3.9214 3.9170 3.9115 4.2233 4.1968 1.0197 1.0280 1.0087 1.0123 1.0017 1.0019 0.9984 1.0024 1.0069 1.0145 0.9925 0.9962 1.0079 0.9948 0.9970 1.0202 0.9984 1.0157 1.0055 1.0147 1.0050 1.0064 1.0093 1.0073 1.0097
dispcorr: -0.025148960 hartree
energy: -1094.902531494836
dipole: -17.16586 17.50130 0.33543 -14.03979 14.06546 0.02567 -13.05334 11.74076 -1.31258
magnitude: 1.35500 au
magnitude: 3.44415 debye
