program: Orca
programVersion: 5.0.2
elementType: O O O O N C C C C C C C C C C C C C C C C C C C H H H H H H H H H H H H H H H H H H H H H H H H H
charge: 0
multiplicity: 1
keywords: wb97x-d3
keywords: def2-TZVPP
keywords: def2/J RIJCOSX
keywords: DEFGRID2
keywords: scfconv7
keywords: smallprint printgap noloewdin
keywords: NOSOSCF
formula: C19H25NO4
InChI: InChI=1/C19H25NO4/c1-11(2)9-14-15(19(14,3)4)18(23)24-10-20-16(21)12-7-5-6-8-13(12)17(20)22/h9,14-15H,5-8,10H2,1-4H3
49 atoms
O  -0.632571 0.859712 1.262326
O  -1.426556 2.928464 0.931466
O  1.628186 2.344329 -0.634168
O  2.199409 -1.03863 2.340904
N  1.684342 0.844338 1.112958
C  -2.396478 0.330193 -1.274698
C  -2.892668 -0.374807 -0.044846
C  -2.615935 1.112041 0.01037
C  -0.999184 0.026221 -1.759319
C  -3.354252 0.632458 -2.401891
C  -4.289407 -0.840512 0.090513
C  -1.513525 1.73612 0.767428
C  -4.686853 -2.075123 0.414315
C  0.571839 1.332642 1.855315
C  -6.14456 -2.402358 0.542348
C  -3.764774 -3.225909 0.68235
C  3.161074 0.468335 -0.614156
C  3.319996 -0.531097 0.255048
C  3.938176 0.643433 -1.864963
C  4.284961 -1.647622 0.105266
C  5.162464 -0.273799 -1.836326
C  4.817488 -1.673417 -1.328897
C  2.090303 1.363107 -0.111226
C  2.367614 -0.337627 1.377087
H  -2.145828 -0.996963 0.435192
H  -3.488056 1.757458 -0.013037
H  -0.539771 0.905514 -2.21551
H  -0.338644 -0.336113 -0.973779
H  -1.041229 -0.751578 -2.524838
H  -2.972715 1.448487 -3.018992
H  -3.473314 -0.24078 -3.046885
H  -4.344426 0.923489 -2.053104
H  -5.058856 -0.093284 -0.082821
H  0.62292 0.94101 2.868808
H  0.599267 2.419274 1.893967
H  -6.779785 -1.532827 0.372289
H  -6.438957 -3.178544 -0.169285
H  -6.372667 -2.795189 1.537143
H  -2.72097 -3.015716 0.455612
H  -3.822651 -3.533206 1.730468
H  -4.059764 -4.096924 0.091383
H  3.298511 0.411864 -2.722977
H  4.23474 1.688141 -1.985086
H  5.102617 -1.51622 0.821417
H  3.810304 -2.597555 0.362979
H  5.595986 -0.334568 -2.835596
H  5.926909 0.167137 -1.190064
H  5.696737 -2.317146 -1.380223
H  4.064218 -2.120253 -1.984194
elementType: O N C H
totalener: -1094.87815935 hartree
nucrepener: 2119.91348259 hartree
electener: -3214.79164194 hartree
oneelecener: -5701.58618205 hartree
twoeener: 2486.79454010 hartree
cpcmener: -0.03327423 hartree
kineticenergy: 1090.03018157 hartree
xcener: -105.969637970660 hartree
chargesum: 0.0000000
charge: -0.274584 -0.451494 -0.401512 -0.408161 -0.081813 0.116839 0.079908 -0.142174 -0.279928 -0.269513 -0.303066 0.413061 -0.034626 0.064749 -0.221902 -0.257166 -0.016019 -0.084477 -0.073106 -0.068409 -0.134562 -0.137868 0.244847 0.325312 0.096787 0.090816 0.100778 0.079737 0.099481 0.099172 0.095260 0.087418 0.116634 0.125989 0.139108 0.087586 0.093441 0.092554 0.089983 0.099053 0.093287 0.101238 0.095056 0.100343 0.093070 0.080780 0.078378 0.080856 0.078858
qa: -0.2746 -0.4515 -0.4015 -0.4082 -0.0818 0.1168 0.0799 -0.1422 -0.2799 -0.2695 -0.3031 0.4131 -0.0346 0.0647 -0.2219 -0.2572 -0.0160 -0.0845 -0.0731 -0.0684 -0.1346 -0.1379 0.2448 0.3253 0.0968 0.0908 0.1008 0.0797 0.0995 0.0992 0.0953 0.0874 0.1166 0.1260 0.1391 0.0876 0.0934 0.0926 0.0900 0.0991 0.0933 0.1012 0.0951 0.1003 0.0931 0.0808 0.0784 0.0809 0.0789
va: 2.1030 2.0571 2.1064 2.1095 3.0890 3.6948 3.7146 3.8621 3.9108 3.9079 3.8708 4.1871 3.7473 3.8752 3.9250 3.9441 3.5983 3.7055 3.9195 3.9187 3.9142 3.9168 4.2321 4.2021 1.0254 1.0344 1.0053 1.0128 1.0025 1.0013 1.0025 1.0058 1.0111 1.0121 1.0202 1.0090 0.9965 0.9955 1.0090 0.9959 0.9980 1.0055 1.0154 1.0050 1.0160 1.0096 1.0066 1.0095 1.0066
dispcorr: -0.024349197 hartree
energy: -1094.902508547945
dipole: -13.82994 15.04595 1.21602 -17.94025 15.96919 -1.97107 -14.63620 13.46326 -1.17295
magnitude: 2.59608 au
magnitude: 6.59870 debye
