program: Orca
programVersion: 5.0.2
elementType: O O O O N C C C C C C C C C C C C C C C C C C C H H H H H H H H H H H H H H H H H H H H H H H H H
charge: 0
multiplicity: 1
keywords: wb97x-d3
keywords: def2-TZVPP
keywords: def2/J RIJCOSX
keywords: DEFGRID2
keywords: scfconv7
keywords: smallprint printgap noloewdin
keywords: NOSOSCF
formula: C19H25NO4
InChI: InChI=1/C19H25NO4/c1-11(2)9-14-15(19(14,3)4)18(23)24-10-20-16(21)12-7-5-6-8-13(12)17(20)22/h9,14-15H,5-8,10H2,1-4H3
49 atoms
O  -0.399592 0.803598 0.074503
O  -1.858832 2.231084 -0.822127
O  2.000249 -0.483255 -1.955631
O  2.363643 1.860624 1.91918
N  1.883382 0.917419 -0.128748
C  -3.88887 0.71107 1.064432
C  -4.016234 0.222235 -0.334763
C  -2.641338 0.267686 0.309952
C  -4.137475 2.170564 1.353074
C  -4.297107 -0.196955 2.199679
C  -4.636036 -1.083754 -0.676159
C  -1.640071 1.214747 -0.204759
C  -4.277052 -1.847415 -1.711193
C  0.673629 1.595176 -0.432304
C  -4.967632 -3.144207 -2.00257
C  -3.1614 -1.489969 -2.645821
C  3.65234 -0.555893 -0.185616
C  3.756423 0.128584 0.954359
C  4.605956 -1.592465 -0.65039
C  4.831805 -0.046932 1.96089
C  5.889363 -1.513058 0.179003
C  5.600715 -1.337376 1.669692
C  2.440556 -0.092956 -0.90581
C  2.622391 1.083038 1.037968
H  -4.168826 1.010025 -1.069432
H  -2.23043 -0.682468 0.632099
H  -3.904403 2.818967 0.51211
H  -5.191392 2.319777 1.594449
H  -3.554852 2.509164 2.211772
H  -5.368607 -0.115607 2.39365
H  -4.074122 -1.24534 2.00139
H  -3.775423 0.081228 3.117469
H  -5.454383 -1.418057 -0.044031
H  0.684165 2.579157 0.035574
H  0.587418 1.716235 -1.511986
H  -5.444506 -3.122268 -2.986092
H  -4.254061 -3.972233 -2.024687
H  -5.732863 -3.378754 -1.262628
H  -2.296928 -2.140273 -2.481693
H  -3.463649 -1.637008 -3.685446
H  -2.822798 -0.460238 -2.540554
H  4.14205 -2.57959 -0.556577
H  4.819897 -1.461659 -1.713764
H  5.500322 0.819401 1.928668
H  4.410697 -0.062708 2.968922
H  6.483024 -2.413917 0.018343
H  6.493936 -0.673224 -0.174618
H  6.535461 -1.338191 2.231872
H  5.019684 -2.191238 2.028896
elementType: O N C H
totalener: -1094.88030312 hartree
nucrepener: 2057.42862799 hartree
electener: -3152.30893111 hartree
oneelecener: -5576.93216248 hartree
twoeener: 2424.62323137 hartree
cpcmener: -0.02922088 hartree
kineticenergy: 1090.03719432 hartree
xcener: -105.968757201634 hartree
chargesum: 0.0000000
charge: -0.278304 -0.474294 -0.409161 -0.407553 -0.113660 0.149683 -0.019434 -0.085112 -0.274588 -0.285477 -0.296016 0.384858 -0.003336 0.088535 -0.227814 -0.247852 -0.071977 -0.073199 -0.073437 -0.070205 -0.135418 -0.137495 0.323231 0.318140 0.100392 0.091885 0.091926 0.094877 0.098438 0.098716 0.092239 0.098282 0.121724 0.131838 0.128785 0.095871 0.093683 0.088722 0.102143 0.098967 0.083560 0.101203 0.093538 0.100650 0.093687 0.080789 0.078399 0.081114 0.078460
qa: -0.2783 -0.4743 -0.4092 -0.4076 -0.1137 0.1497 -0.0194 -0.0851 -0.2746 -0.2855 -0.2960 0.3849 -0.0033 0.0885 -0.2278 -0.2479 -0.0720 -0.0732 -0.0734 -0.0702 -0.1354 -0.1375 0.3232 0.3181 0.1004 0.0919 0.0919 0.0949 0.0984 0.0987 0.0922 0.0983 0.1217 0.1318 0.1288 0.0959 0.0937 0.0887 0.1021 0.0990 0.0836 0.1012 0.0935 0.1006 0.0937 0.0808 0.0784 0.0811 0.0785
va: 2.1048 2.0269 2.1083 2.1108 3.1250 3.7113 3.8211 3.8244 3.8895 3.9111 3.8951 4.1275 3.6973 3.8887 3.9329 3.9403 3.6672 3.6772 3.9220 3.9196 3.9133 3.9168 4.2132 4.2177 1.0268 1.0297 1.0186 1.0007 0.9997 0.9997 1.0015 1.0030 1.0033 1.0035 1.0028 0.9962 0.9959 1.0063 0.9976 1.0005 1.0132 1.0050 1.0152 1.0047 1.0155 1.0097 1.0066 1.0093 1.0066
dispcorr: -0.022434690 hartree
energy: -1094.902737811959
dipole: -15.94651 17.34630 1.39979 -14.18952 12.53123 -1.65830 1.57804 -0.92257 0.65547
magnitude: 2.26694 au
magnitude: 5.76210 debye
