program: Orca
programVersion: 5.0.2
elementType: O O O O N C C C C C C C C C C C C C C C C C C C H H H H H H H H H H H H H H H H H H H H H H H H H
charge: 0
multiplicity: 1
keywords: wb97x-d3
keywords: def2-TZVPP
keywords: def2/J RIJCOSX
keywords: DEFGRID2
keywords: scfconv7
keywords: smallprint printgap noloewdin
keywords: NOSOSCF
formula: C19H25NO4
InChI: InChI=1/C19H25NO4/c1-11(2)9-14-15(19(14,3)4)18(23)24-10-20-16(21)12-7-5-6-8-13(12)17(20)22/h9,14-15H,5-8,10H2,1-4H3
49 atoms
O  -0.185679 0.156078 -0.527394
O  -1.707338 0.507986 -2.118471
O  2.314678 2.410159 -0.257685
O  2.490125 -2.081883 -0.90659
N  2.091445 0.187373 -0.82068
C  -3.493394 1.241531 0.38406
C  -3.853117 -0.120352 -0.127953
C  -2.398978 0.211572 0.158771
C  -3.647392 2.418555 -0.547239
C  -3.767863 1.594781 1.825787
C  -4.540647 -1.135651 0.692051
C  -1.440816 0.314141 -0.955776
C  -5.544404 -1.910239 0.26964
C  0.849433 0.24799 -1.505443
C  -6.174628 -2.920557 1.178279
C  -6.111028 -1.832461 -1.124352
C  3.94695 0.75424 0.419155
C  4.001064 -0.564063 0.223156
C  4.953926 1.550794 1.160815
C  5.091802 -1.452278 0.693351
C  5.875707 0.612035 1.941842
C  6.293282 -0.603573 1.114758
C  2.71887 1.277085 -0.227945
C  2.805258 -0.975645 -0.553424
H  -4.098115 -0.138438 -1.185251
H  -1.9812 -0.208649 1.066962
H  -2.915715 3.197735 -0.322319
H  -3.545278 2.152677 -1.597142
H  -4.640248 2.855325 -0.41884
H  -4.807545 1.904197 1.953056
H  -3.582319 0.768088 2.510411
H  -3.135266 2.426986 2.141037
H  -4.19106 -1.258023 1.712784
H  0.782629 1.187603 -2.05381
H  0.786147 -0.580283 -2.211494
H  -7.243684 -2.726103 1.301373
H  -6.092705 -3.928269 0.761254
H  -5.717741 -2.928699 2.168097
H  -5.367486 -2.082947 -1.884072
H  -6.942972 -2.52503 -1.251687
H  -6.485185 -0.834686 -1.361285
H  5.526011 2.157714 0.451367
H  4.459757 2.259072 1.830393
H  4.730663 -2.059119 1.53016
H  5.370087 -2.159398 -0.091854
H  6.759407 1.160632 2.271449
H  5.361763 0.274865 2.8467
H  6.992946 -1.218714 1.682672
H  6.826612 -0.26752 0.220836
elementType: O N C H
totalener: -1094.88057324 hartree
nucrepener: 2026.08052097 hartree
electener: -3120.96109421 hartree
oneelecener: -5514.23332681 hartree
twoeener: 2393.27223260 hartree
cpcmener: -0.03027112 hartree
kineticenergy: 1090.03092892 hartree
xcener: -105.967847645820 hartree
chargesum: 0.0000000
charge: -0.275957 -0.470964 -0.407723 -0.407730 -0.111668 0.098334 0.049731 -0.092638 -0.273660 -0.269328 -0.294872 0.399242 -0.010972 0.089559 -0.222410 -0.284385 -0.071521 -0.076667 -0.069567 -0.074193 -0.136659 -0.135501 0.316291 0.323147 0.090072 0.087212 0.098214 0.091752 0.095680 0.097184 0.087369 0.097916 0.115118 0.129508 0.131761 0.096367 0.097306 0.083956 0.102694 0.094706 0.104519 0.100662 0.094002 0.101407 0.093698 0.080998 0.078740 0.080722 0.078551
qa: -0.2760 -0.4710 -0.4077 -0.4077 -0.1117 0.0983 0.0497 -0.0926 -0.2737 -0.2693 -0.2949 0.3992 -0.0110 0.0896 -0.2224 -0.2844 -0.0715 -0.0767 -0.0696 -0.0742 -0.1367 -0.1355 0.3163 0.3231 0.0901 0.0872 0.0982 0.0918 0.0957 0.0972 0.0874 0.0979 0.1151 0.1295 0.1318 0.0964 0.0973 0.0840 0.1027 0.0947 0.1045 0.1007 0.0940 0.1014 0.0937 0.0810 0.0787 0.0807 0.0786
va: 2.1135 2.0340 2.1100 2.1106 3.1232 3.7103 3.7641 3.8772 3.9044 3.9139 3.9014 4.1486 3.6949 3.8846 3.9205 3.9400 3.6679 3.6765 3.9208 3.9218 3.9159 3.9136 4.2187 4.2149 1.0292 1.0344 0.9998 1.0193 1.0003 1.0017 1.0065 1.0019 1.0109 1.0026 1.0030 0.9928 0.9927 1.0106 0.9967 1.0048 0.9955 1.0047 1.0153 1.0048 1.0152 1.0095 1.0064 1.0097 1.0067
dispcorr: -0.021515731 hartree
energy: -1094.902088971752
dipole: -21.61247 22.88359 1.27112 -2.42401 2.27839 -0.14562 11.26344 -9.71146 1.55198
magnitude: 2.01136 au
magnitude: 5.11248 debye
