program: Orca
programVersion: 5.0.2
elementType: O O O O N C C C C C C C C C C C C C C C C C C C H H H H H H H H H H H H H H H H H H H H H H H H H
charge: 0
multiplicity: 1
keywords: wb97x-d3
keywords: def2-TZVPP
keywords: def2/J RIJCOSX
keywords: DEFGRID2
keywords: scfconv7
keywords: smallprint printgap noloewdin
keywords: NOSOSCF
formula: C19H25NO4
InChI: InChI=1/C19H25NO4/c1-11(2)9-14-15(19(14,3)4)18(23)24-10-20-16(21)12-7-5-6-8-13(12)17(20)22/h9,14-15H,5-8,10H2,1-4H3
49 atoms
O  -0.162381 -1.145329 0.20238
O  -1.350672 -1.37732 -1.684697
O  1.540654 0.710251 -1.669956
O  3.183847 -2.023971 1.562186
N  2.107879 -0.935407 -0.165397
C  -2.80421 1.154719 -0.53751
C  -3.658939 -0.057527 -0.352713
C  -2.216531 -0.081591 0.128231
C  -2.390589 1.539595 -1.937101
C  -2.981742 2.351817 0.365649
C  -4.76632 -0.122462 0.621791
C  -1.235327 -0.927248 -0.571169
C  -5.773301 -1.002702 0.61241
C  0.978242 -1.782749 -0.357061
C  -6.861206 -0.934561 1.641614
C  -5.934659 -2.106317 -0.388742
C  3.508208 0.889942 -0.263349
C  3.994726 0.076708 0.675336
C  4.103339 2.189727 -0.658766
C  5.231007 0.317028 1.457521
C  5.14363 2.61093 0.381052
C  6.034872 1.444001 0.805328
C  2.279004 0.275247 -0.823205
C  3.096342 -1.099022 0.796876
H  -3.811683 -0.623491 -1.26507
H  -2.057935 0.011054 1.196759
H  -3.07926 2.293618 -2.323631
H  -1.389017 1.975071 -1.946753
H  -2.401438 0.705743 -2.635335
H  -3.818562 2.967594 0.029381
H  -3.164264 2.081228 1.40499
H  -2.085351 2.974685 0.346326
H  -4.75948 0.621945 1.412292
H  0.839188 -1.989468 -1.416215
H  1.149869 -2.7207 0.167788
H  -7.842588 -0.839678 1.167988
H  -6.896279 -1.849672 2.239362
H  -6.735961 -0.092604 2.322933
H  -6.116364 -3.057387 0.118918
H  -6.805906 -1.927404 -1.026373
H  -5.071047 -2.243106 -1.03772
H  4.559818 2.092942 -1.649156
H  3.323567 2.948414 -0.760567
H  4.964027 0.573878 2.487854
H  5.823567 -0.598945 1.521354
H  5.753547 3.421217 -0.020775
H  4.630325 3.011463 1.260065
H  6.802766 1.791961 1.497788
H  6.558767 1.05039 -0.070609
elementType: O N C H
totalener: -1094.87928859 hartree
nucrepener: 2063.42471711 hartree
electener: -3158.30400571 hartree
oneelecener: -5589.21888642 hartree
twoeener: 2430.91488071 hartree
cpcmener: -0.03051812 hartree
kineticenergy: 1090.03946714 hartree
xcener: -105.971706507795 hartree
chargesum: 0.0000000
charge: -0.284103 -0.458737 -0.414735 -0.409364 -0.093701 0.116974 -0.007797 -0.067566 -0.274284 -0.290557 -0.263938 0.389092 -0.027836 0.080937 -0.224974 -0.258835 -0.057729 -0.081693 -0.069427 -0.074243 -0.136309 -0.135275 0.313781 0.322932 0.099160 0.091559 0.097029 0.093269 0.094541 0.102184 0.090144 0.097840 0.114673 0.141028 0.124102 0.092311 0.093865 0.087463 0.092785 0.098888 0.089962 0.100005 0.093524 0.101155 0.093564 0.081002 0.078384 0.080507 0.078444
qa: -0.2841 -0.4587 -0.4147 -0.4094 -0.0937 0.1170 -0.0078 -0.0676 -0.2743 -0.2906 -0.2639 0.3891 -0.0278 0.0809 -0.2250 -0.2588 -0.0577 -0.0817 -0.0694 -0.0742 -0.1363 -0.1353 0.3138 0.3229 0.0992 0.0916 0.0970 0.0933 0.0945 0.1022 0.0901 0.0978 0.1147 0.1410 0.1241 0.0923 0.0939 0.0875 0.0928 0.0989 0.0900 0.1000 0.0935 0.1012 0.0936 0.0810 0.0784 0.0805 0.0784
va: 2.1062 2.0523 2.0977 2.1096 3.0921 3.7221 3.8286 3.7859 3.8955 3.9180 3.9046 4.1850 3.7441 3.8553 3.9270 3.9406 3.6609 3.6980 3.9192 3.9207 3.9152 3.9132 4.2148 4.2253 1.0210 1.0326 1.0011 1.0058 1.0176 0.9998 1.0053 1.0013 1.0112 1.0166 1.0147 0.9950 0.9964 1.0088 0.9977 0.9958 1.0119 1.0051 1.0153 1.0052 1.0155 1.0093 1.0066 1.0096 1.0066
dispcorr: -0.022401624 hartree
energy: -1094.901690219195
dipole: -20.80209 21.88654 1.08445 12.08852 -10.72024 1.36828 3.20343 -2.27436 0.92907
magnitude: 1.97772 au
magnitude: 5.02697 debye
