program: Orca
programVersion: 5.0.2
elementType: O O O O N C C C C C C C C C C C C C C C C C C C H H H H H H H H H H H H H H H H H H H H H H H H H
charge: 0
multiplicity: 1
keywords: wb97x-d3
keywords: def2-TZVPP
keywords: def2/J RIJCOSX
keywords: DEFGRID2
keywords: scfconv7
keywords: smallprint printgap noloewdin
keywords: NOSOSCF
formula: C19H25NO4
InChI: InChI=1/C19H25NO4/c1-11(2)9-14-15(19(14,3)4)18(23)24-10-20-16(21)12-7-5-6-8-13(12)17(20)22/h9,14-15H,5-8,10H2,1-4H3
49 atoms
O  -0.515565 1.865103 1.105992
O  -0.661616 1.515125 -1.097545
O  1.635197 0.082213 2.48446
O  2.394482 2.175311 -1.479333
N  1.748154 1.403259 0.60112
C  -3.697081 1.03577 -0.524889
C  -3.014759 -0.293769 -0.443155
C  -2.467048 0.886542 0.350702
C  -3.634368 1.792685 -1.829413
C  -4.996359 1.255458 0.213152
C  -3.566503 -1.44047 0.303255
C  -1.150949 1.443622 0.002883
C  -3.576476 -2.719533 -0.086119
C  0.793566 2.397528 0.974606
C  -4.144592 -3.783808 0.804834
C  -3.038971 -3.223957 -1.390239
C  3.024871 -0.514183 0.591128
C  3.237054 0.098175 -0.574001
C  3.655205 -1.789008 1.013142
C  4.127925 -0.399395 -1.650244
C  4.822716 -2.116138 0.079897
C  4.472005 -1.866128 -1.386242
C  2.068418 0.300063 1.381893
C  2.436268 1.348173 -0.606919
H  -2.426641 -0.538705 -1.321189
H  -2.670115 0.862406 1.415498
H  -2.771206 1.534613 -2.438234
H  -4.526606 1.569125 -2.418101
H  -3.617195 2.871431 -1.660189
H  -5.180176 2.323318 0.347178
H  -5.833125 0.845697 -0.356618
H  -5.011122 0.797068 1.201066
H  -3.989161 -1.210784 1.277216
H  1.029705 2.798115 1.957712
H  0.830443 3.208451 0.247102
H  -4.504053 -3.381763 1.752149
H  -4.977018 -4.301873 0.320921
H  -3.394916 -4.548145 1.027731
H  -2.194481 -3.898716 -1.224248
H  -3.798772 -3.808452 -1.915557
H  -2.706192 -2.438386 -2.066034
H  3.991797 -1.723311 2.050605
H  2.904625 -2.585889 0.990999
H  3.650914 -0.279077 -2.625919
H  5.034923 0.213175 -1.681436
H  5.68591 -1.503181 0.355255
H  5.122036 -3.155778 0.220863
H  3.618868 -2.490861 -1.666348
H  5.302595 -2.16756 -2.026151
elementType: O N C H
totalener: -1094.87984149 hartree
nucrepener: 2107.76396145 hartree
electener: -3202.64380294 hartree
oneelecener: -5678.16749206 hartree
twoeener: 2475.52368912 hartree
cpcmener: -0.03314162 hartree
kineticenergy: 1090.03977144 hartree
xcener: -105.971600235509 hartree
chargesum: 0.0000000
charge: -0.283554 -0.463179 -0.409856 -0.402652 -0.102868 0.107605 0.041127 -0.108415 -0.277353 -0.269371 -0.273759 0.409132 -0.049121 0.087357 -0.216232 -0.253136 -0.078948 -0.068417 -0.071523 -0.079439 -0.138433 -0.133592 0.313050 0.318883 0.098095 0.086372 0.093730 0.094069 0.097972 0.096698 0.097304 0.087959 0.116045 0.143807 0.130868 0.087525 0.092848 0.092364 0.097658 0.094114 0.089374 0.092902 0.101111 0.093794 0.100747 0.077861 0.080791 0.078161 0.080524
qa: -0.2836 -0.4632 -0.4099 -0.4027 -0.1029 0.1076 0.0411 -0.1084 -0.2774 -0.2694 -0.2738 0.4091 -0.0491 0.0874 -0.2162 -0.2531 -0.0789 -0.0684 -0.0715 -0.0794 -0.1384 -0.1336 0.3130 0.3189 0.0981 0.0864 0.0937 0.0941 0.0980 0.0967 0.0973 0.0880 0.1160 0.1438 0.1309 0.0875 0.0928 0.0924 0.0977 0.0941 0.0894 0.0929 0.1011 0.0938 0.1007 0.0779 0.0808 0.0782 0.0805
va: 2.1158 2.0484 2.1072 2.1143 3.0755 3.6862 3.7791 3.8322 3.9001 3.9137 3.8819 4.1588 3.7654 3.8872 3.9205 3.9412 3.6847 3.6539 3.9177 3.9207 3.9167 3.9138 4.2197 4.2124 1.0278 1.0382 1.0205 0.9999 0.9997 1.0018 1.0016 1.0063 1.0121 0.9931 1.0173 1.0092 0.9966 0.9960 0.9963 0.9975 1.0106 1.0156 1.0048 1.0156 1.0044 1.0065 1.0094 1.0066 1.0096
dispcorr: -0.022604560 hartree
energy: -1094.902446050149
dipole: -18.66644 18.99935 0.33291 -19.44403 18.10602 -1.33801 -6.50150 6.73942 0.23792
magnitude: 1.39918 au
magnitude: 3.55643 debye
