program: Orca
programVersion: 5.0.2
elementType: O O O O N C C C C C C C C C C C C C C C C C C C H H H H H H H H H H H H H H H H H H H H H H H H H
charge: 0
multiplicity: 1
keywords: wb97x-d3
keywords: def2-TZVPP
keywords: def2/J RIJCOSX
keywords: DEFGRID2
keywords: scfconv7
keywords: smallprint printgap noloewdin
keywords: NOSOSCF
formula: C19H25NO4
InChI: InChI=1/C19H25NO4/c1-11(2)9-14-15(19(14,3)4)18(23)24-10-20-16(21)12-7-5-6-8-13(12)17(20)22/h9,14-15H,5-8,10H2,1-4H3
49 atoms
O  -0.154528 0.119645 1.257416
O  -1.367703 -1.698311 1.753602
O  1.903984 -1.647086 -0.515669
O  2.878551 1.792553 2.295923
N  2.136922 -0.075723 1.15759
C  -2.723309 -0.780117 -0.963835
C  -3.637936 -0.602683 0.212366
C  -2.248299 -0.037046 0.275196
C  -2.184265 -2.154797 -1.275608
C  -2.946261 0.069913 -2.190078
C  -4.807023 0.313072 0.188408
C  -1.250313 -0.652716 1.174699
C  -6.007331 -0.004078 -0.298145
C  0.983157 -0.404992 1.922405
C  -7.151536 0.961493 -0.249926
C  -6.313281 -1.334723 -0.914604
C  3.646348 0.033764 -0.575361
C  3.931885 1.039929 0.25079
C  4.379031 -0.277888 -1.827434
C  5.050069 1.999183 0.07149
C  5.273346 0.905412 -2.20156
C  6.015781 1.462905 -0.986483
C  2.47191 -0.704397 -0.039011
C  2.956782 1.028804 1.37468
H  -3.766084 -1.498868 0.81415
H  -2.139706 1.035342 0.149472
H  -2.123339 -2.794441 -0.398176
H  -2.83377 -2.648346 -2.00167
H  -1.185327 -2.095051 -1.71213
H  -2.021894 0.166042 -2.76253
H  -3.695077 -0.386725 -2.840495
H  -3.298099 1.071256 -1.945169
H  -4.669277 1.29862 0.624032
H  0.903613 -1.48539 2.031809
H  1.077865 0.054736 2.905692
H  -7.52754 1.176666 -1.253284
H  -7.990995 0.54803 0.314664
H  -6.870394 1.906177 0.213801
H  -5.443481 -1.98688 -0.965942
H  -7.090172 -1.855206 -0.348855
H  -6.699925 -1.212365 -1.929443
H  4.974885 -1.185137 -1.683362
H  3.675273 -0.512503 -2.629266
H  4.648114 2.973158 -0.225961
H  5.560259 2.168971 1.022329
H  5.985706 0.602264 -2.970151
H  4.658349 1.695337 -2.642305
H  6.702731 2.252364 -1.29424
H  6.629299 0.672341 -0.544689
totalener: -1094.85470390 hartree
nucrepener: 2060.18269147 hartree
electener: -3155.03739538 hartree
oneelecener: -5582.26179517 hartree
twoeener: 2427.22439979 hartree
kineticenergy: 1090.11123905 hartree
xcener: -105.973571575308 hartree
chargesum: 0.0000000
charge: -0.267845 -0.377140 -0.323868 -0.319103 -0.113649 0.075410 -0.027312 -0.089921 -0.260717 -0.246891 -0.190997 0.343343 -0.026317 0.072614 -0.211620 -0.237609 -0.068135 -0.101823 -0.074251 -0.075374 -0.134911 -0.135315 0.253893 0.270080 0.107900 0.079661 0.100414 0.080803 0.097858 0.095519 0.085955 0.081142 0.088737 0.135809 0.115170 0.083792 0.085842 0.079151 0.082646 0.096264 0.084793 0.092596 0.094129 0.093713 0.093766 0.079628 0.075871 0.080601 0.075699
qa: -0.2678 -0.3771 -0.3239 -0.3191 -0.1136 0.0754 -0.0273 -0.0899 -0.2607 -0.2469 -0.1910 0.3433 -0.0263 0.0726 -0.2116 -0.2376 -0.0681 -0.1018 -0.0743 -0.0754 -0.1349 -0.1353 0.2539 0.2701 0.1079 0.0797 0.1004 0.0808 0.0979 0.0955 0.0860 0.0811 0.0887 0.1358 0.1152 0.0838 0.0858 0.0792 0.0826 0.0963 0.0848 0.0926 0.0941 0.0937 0.0938 0.0796 0.0759 0.0806 0.0757
va: 2.1092 2.1289 2.1831 2.1953 3.0918 3.7489 3.8154 3.8664 3.9056 3.9044 3.8589 4.2371 3.7383 3.8862 3.9396 3.9378 3.6155 3.6571 3.9254 3.9248 3.8979 3.8964 4.2739 4.2784 1.0271 1.0332 1.0202 1.0008 1.0076 1.0054 1.0033 1.0072 1.0135 1.0137 1.0098 0.9988 0.9981 1.0105 1.0110 1.0024 0.9999 1.0083 1.0191 1.0088 1.0193 1.0117 1.0088 1.0117 1.0088
dispcorr: -0.023219618 hartree
energy: -1094.877923521418
dipole: -21.41123 22.23998 0.82875 0.91264 -0.25982 0.65282 -18.74982 17.48567 -1.26415
magnitude: 1.64653 au
magnitude: 4.18515 debye
