program: Orca
programVersion: 5.0.2
elementType: O O O O N C C C C C C C C C C C C C C C C C C C H H H H H H H H H H H H H H H H H H H H H H H H H
charge: 0
multiplicity: 1
keywords: wb97x-d3
keywords: def2-TZVPP
keywords: def2/J RIJCOSX
keywords: DEFGRID2
keywords: scfconv7
keywords: smallprint printgap noloewdin
keywords: NOSOSCF
formula: C19H25NO4
InChI: InChI=1/C19H25NO4/c1-11(2)9-14-15(19(14,3)4)18(23)24-10-20-16(21)12-7-5-6-8-13(12)17(20)22/h9,14-15H,5-8,10H2,1-4H3
49 atoms
O  -0.429895 1.654298 0.172159
O  -1.651779 1.924967 -1.692689
O  2.970247 2.1291 1.445645
O  1.082675 -0.405014 -1.826302
N  1.788405 1.164841 -0.290044
C  -4.064442 1.207401 0.155569
C  -3.600032 -0.041354 -0.512023
C  -2.593113 0.830442 0.215507
C  -4.540567 2.357994 -0.696995
C  -4.799922 1.098898 1.470429
C  -3.940804 -1.38814 0.013976
C  -1.552286 1.526122 -0.564815
C  -3.100623 -2.417798 0.12948
C  0.745688 2.124097 -0.460492
C  -3.561424 -3.738201 0.669175
C  -1.6550 -2.36018 -0.259921
C  3.562082 -0.040214 0.547101
C  3.016104 -0.777708 -0.4192
C  4.757735 -0.423257 1.339063
C  3.498593 -2.112576 -0.852606
C  5.464401 -1.599887 0.661639
C  4.474219 -2.664962 0.188247
C  2.785391 1.223388 0.681501
C  1.84578 -0.046213 -0.972882
H  -3.531813 0.03197 -1.59534
H  -2.25537 0.457821 1.175566
H  -4.403787 3.310658 -0.182222
H  -4.027297 2.417003 -1.652603
H  -5.607697 2.242982 -0.896224
H  -5.87071 0.966037 1.302679
H  -4.453941 0.260066 2.074211
H  -4.668914 2.008805 2.058075
H  -4.977321 -1.53786 0.304858
H  1.057082 3.04933 0.0223
H  0.571915 2.301576 -1.520652
H  -3.43133 -4.531265 -0.071505
H  -2.974606 -4.03091 1.543775
H  -4.611087 -3.720093 0.960269
H  -1.012079 -2.464421 0.619012
H  -1.405667 -3.190813 -0.924672
H  -1.379274 -1.442141 -0.771088
H  5.429815 0.430714 1.448684
H  4.448962 -0.688197 2.355606
H  2.655368 -2.789969 -1.005214
H  3.984514 -2.02127 -1.829565
H  6.033499 -1.229995 -0.196205
H  6.189669 -2.03966 1.34778
H  3.90924 -3.039454 1.046767
H  5.011053 -3.519843 -0.225482
totalener: -1094.85391597 hartree
nucrepener: 2113.42095991 hartree
electener: -3208.27487587 hartree
oneelecener: -5688.76239950 hartree
twoeener: 2480.48752363 hartree
kineticenergy: 1090.09053315 hartree
xcener: -105.970888661480 hartree
chargesum: 0.0000000
charge: -0.273222 -0.378813 -0.319935 -0.321799 -0.108302 0.132651 -0.009453 -0.143754 -0.262105 -0.267829 -0.247167 0.359151 0.001562 0.069278 -0.213911 -0.222616 -0.101210 -0.066334 -0.075516 -0.074929 -0.136024 -0.134974 0.269641 0.246740 0.108167 0.089839 0.083309 0.104041 0.081986 0.088275 0.085289 0.092312 0.092532 0.113649 0.139821 0.087829 0.082704 0.078566 0.080620 0.088434 0.094916 0.094363 0.093132 0.093390 0.093144 0.076364 0.080247 0.075774 0.080170
qa: -0.2732 -0.3788 -0.3199 -0.3218 -0.1083 0.1327 -0.0095 -0.1438 -0.2621 -0.2678 -0.2472 0.3592 0.0016 0.0693 -0.2139 -0.2226 -0.1012 -0.0663 -0.0755 -0.0749 -0.1360 -0.1350 0.2696 0.2467 0.1082 0.0898 0.0833 0.1040 0.0820 0.0883 0.0853 0.0923 0.0925 0.1136 0.1398 0.0878 0.0827 0.0786 0.0806 0.0884 0.0949 0.0944 0.0931 0.0934 0.0931 0.0764 0.0802 0.0758 0.0802
va: 2.0993 2.1251 2.1954 2.1828 3.0918 3.7254 3.8141 3.8540 3.9057 3.9070 3.9042 4.1670 3.7453 3.8788 3.9418 3.9415 3.6523 3.6153 3.9226 3.9284 3.8979 3.8979 4.2784 4.2644 1.0239 1.0308 1.0025 1.0227 1.0015 1.0021 1.0054 1.0060 1.0101 1.0120 1.0158 0.9987 0.9989 1.0100 0.9996 1.0038 1.0144 1.0192 1.0083 1.0186 1.0081 1.0084 1.0119 1.0086 1.0118
dispcorr: -0.024068849 hartree
energy: -1094.877984816458
dipole: -14.47639 15.36884 0.89246 -17.18732 15.95570 -1.23162 5.95135 -5.28949 0.66185
magnitude: 1.65874 au
magnitude: 4.21618 debye
