program: Orca
programVersion: 5.0.2
elementType: O O O O N C C C C C C C C C C C C C C C C C C C H H H H H H H H H H H H H H H H H H H H H H H H H
charge: 0
multiplicity: 1
keywords: wb97x-d3
keywords: def2-TZVPP
keywords: def2/J RIJCOSX
keywords: DEFGRID2
keywords: scfconv7
keywords: smallprint printgap noloewdin
keywords: NOSOSCF
formula: C19H25NO4
InChI: InChI=1/C19H25NO4/c1-11(2)9-14-15(19(14,3)4)18(23)24-10-20-16(21)12-7-5-6-8-13(12)17(20)22/h9,14-15H,5-8,10H2,1-4H3
49 atoms
O  -0.373475 1.557352 -0.097383
O  -1.798331 1.968631 -1.778692
O  2.895812 2.287524 1.10496
O  1.201393 -0.612365 -1.961255
N  1.830502 1.1337 -0.590126
C  -3.983643 1.217294 0.337727
C  -3.665208 0.009111 -0.476455
C  -2.53675 0.787695 0.170778
C  -4.505016 2.455052 -0.349811
C  -4.549555 1.026425 1.725847
C  -3.992529 -1.362029 -0.006846
C  -1.578203 1.504515 -0.692432
C  -3.17604 -2.416959 -0.027996
C  0.738565 2.009699 -0.851731
C  -3.630175 -3.755961 0.470824
C  -1.768457 -2.378318 -0.539654
C  3.542358 0.037664 0.490956
C  3.05304 -0.809468 -0.414258
C  4.67742 -0.251098 1.40281
C  3.549636 -2.188001 -0.650907
C  5.411835 -1.506779 0.926632
C  4.442255 -2.615608 0.51589
C  2.762755 1.304134 0.432266
C  1.919335 -0.152361 -1.117272
H  -3.738191 0.162412 -1.551045
H  -2.090389 0.332255 1.047242
H  -4.138258 2.562366 -1.367081
H  -5.595418 2.417949 -0.389036
H  -4.227273 3.354038 0.203882
H  -4.151639 0.139277 2.218798
H  -4.321117 1.888811 2.354122
H  -5.636129 0.924764 1.687926
H  -5.004051 -1.506986 0.363522
H  1.013512 3.014303 -0.5319
H  0.512175 2.014338 -1.916846
H  -4.65211 -3.731091 0.847167
H  -3.58204 -4.505962 -0.322575
H  -2.983383 -4.114202 1.275784
H  -1.614778 -3.15769 -1.289608
H  -1.495412 -1.431887 -0.997424
H  -1.056537 -2.581564 0.265054
H  5.352605 0.605898 1.453849
H  4.295609 -0.386443 2.420118
H  2.710473 -2.875053 -0.781067
H  4.103884 -2.216633 -1.594746
H  6.047117 -1.249551 0.074144
H  6.07923 -1.863283 1.712543
H  3.81315 -2.881306 1.370468
H  4.99522 -3.516857 0.247326
totalener: -1094.85411609 hartree
nucrepener: 2110.50635175 hartree
electener: -3205.36046783 hartree
oneelecener: -5682.84781965 hartree
twoeener: 2477.48735182 hartree
kineticenergy: 1090.09399139 hartree
xcener: -105.970743078456 hartree
chargesum: 0.0000000
charge: -0.269777 -0.382016 -0.317266 -0.324169 -0.118488 0.125939 -0.004241 -0.134075 -0.262603 -0.265357 -0.246808 0.343916 0.000705 0.081623 -0.213036 -0.223275 -0.099563 -0.062396 -0.074780 -0.077391 -0.135726 -0.134224 0.268841 0.247699 0.106279 0.090550 0.103934 0.081670 0.085078 0.085180 0.091941 0.088553 0.092388 0.113775 0.135991 0.078178 0.087991 0.082295 0.090196 0.097706 0.077932 0.094542 0.093765 0.093787 0.093063 0.075869 0.080294 0.075336 0.080176
qa: -0.2698 -0.3820 -0.3173 -0.3242 -0.1185 0.1259 -0.0042 -0.1341 -0.2626 -0.2654 -0.2468 0.3439 0.0007 0.0816 -0.2130 -0.2233 -0.0996 -0.0624 -0.0748 -0.0774 -0.1357 -0.1342 0.2688 0.2477 0.1063 0.0905 0.1039 0.0817 0.0851 0.0852 0.0919 0.0886 0.0924 0.1138 0.1360 0.0782 0.0880 0.0823 0.0902 0.0977 0.0779 0.0945 0.0938 0.0938 0.0931 0.0759 0.0803 0.0753 0.0802
va: 2.0984 2.1192 2.1964 2.1783 3.1059 3.7331 3.8038 3.8577 3.9067 3.9061 3.8988 4.1728 3.7416 3.8877 3.9411 3.9392 3.6502 3.6099 3.9228 3.9263 3.8984 3.8981 4.2796 4.2647 1.0246 1.0289 1.0215 1.0018 1.0018 1.0058 1.0063 1.0025 1.0107 1.0077 1.0133 1.0101 0.9990 0.9992 1.0039 1.0138 1.0005 1.0189 1.0085 1.0188 1.0079 1.0085 1.0116 1.0089 1.0118
dispcorr: -0.023936682 hartree
energy: -1094.878052769451
dipole: -14.47903 15.42405 0.94502 -17.03137 15.76203 -1.26934 8.39134 -7.56756 0.82378
magnitude: 1.78407 au
magnitude: 4.53473 debye
