program: Orca
programVersion: 5.0.2
elementType: O O O O N C C C C C C C C C C C C C C C C C C C H H H H H H H H H H H H H H H H H H H H H H H H H
charge: 0
multiplicity: 1
keywords: wb97x-d3
keywords: def2-TZVPP
keywords: def2/J RIJCOSX
keywords: DEFGRID2
keywords: scfconv7
keywords: smallprint printgap noloewdin
keywords: NOSOSCF
formula: C19H25NO4
InChI: InChI=1/C19H25NO4/c1-11(2)9-14-15(19(14,3)4)18(23)24-10-20-16(21)12-7-5-6-8-13(12)17(20)22/h9,14-15H,5-8,10H2,1-4H3
49 atoms
O  -0.643452 1.104203 1.54884
O  -0.402938 -1.054473 1.002907
O  1.417837 2.648488 -0.158868
O  2.539171 -1.096117 2.179374
N  1.695315 0.864787 1.281835
C  -2.237488 0.14931 -1.342549
C  -2.904044 -0.948516 -0.578482
C  -2.27085 0.19164 0.176751
C  -0.94157 -0.146146 -2.059576
C  -3.081273 1.188571 -2.038903
C  -4.378497 -1.131496 -0.572115
C  -1.028074 -0.029757 0.942626
C  -5.079231 -1.625973 0.449349
C  0.620304 1.119784 2.186719
C  -6.564334 -1.808733 0.363364
C  -4.455212 -2.042814 1.745936
C  2.985589 0.86432 -0.623645
C  3.300506 -0.238662 0.053981
C  3.574357 1.262005 -1.927314
C  4.311679 -1.240111 -0.365551
C  4.317622 0.070581 -2.535774
C  5.166088 -0.663156 -1.496455
C  1.948032 1.612668 0.13579
C  2.493179 -0.283129 1.302455
H  -2.328111 -1.869572 -0.529042
H  -2.934188 0.940646 0.595337
H  -0.35532 -0.921145 -1.569285
H  -1.150309 -0.487748 -3.07516
H  -0.324704 0.752333 -2.133945
H  -3.361085 0.853687 -3.040194
H  -3.999212 1.412959 -1.495631
H  -2.524288 2.120867 -2.144903
H  -4.909007 -0.870749 -1.483499
H  0.681244 0.381929 2.98807
H  0.701802 2.121063 2.603833
H  -6.841163 -2.856416 0.504567
H  -7.075143 -1.244181 1.147491
H  -6.962131 -1.48396 -0.597396
H  -4.664839 -3.095579 1.951669
H  -3.375365 -1.912204 1.762788
H  -4.877392 -1.476228 2.580058
H  2.794111 1.624875 -2.600442
H  4.252804 2.108237 -1.777936
H  4.92903 -1.535928 0.485637
H  3.800874 -2.152569 -0.689712
H  3.590032 -0.625368 -2.963573
H  4.94533 0.408704 -3.361658
H  5.8995 0.030663 -1.075133
H  5.735708 -1.462132 -1.97347
totalener: -1094.85127300 hartree
nucrepener: 2151.28846699 hartree
electener: -3246.13973999 hartree
oneelecener: -5764.64481064 hartree
twoeener: 2518.50507065 hartree
kineticenergy: 1090.09412704 hartree
xcener: -105.971598750758 hartree
chargesum: -0.0000000
charge: -0.253963 -0.372146 -0.313280 -0.305489 -0.118803 0.157756 -0.022739 -0.103858 -0.283699 -0.284866 -0.241901 0.319719 -0.004514 0.089476 -0.211550 -0.224825 -0.108089 -0.044884 -0.082356 -0.073463 -0.131086 -0.137583 0.224732 0.260196 0.106401 0.084314 0.094233 0.092462 0.087879 0.089708 0.083526 0.099625 0.093868 0.127505 0.120646 0.086773 0.084473 0.077807 0.088866 0.082472 0.084235 0.091090 0.094014 0.093222 0.096032 0.075621 0.078696 0.074245 0.079501
qa: -0.2540 -0.3721 -0.3133 -0.3055 -0.1188 0.1578 -0.0227 -0.1039 -0.2837 -0.2849 -0.2419 0.3197 -0.0045 0.0895 -0.2115 -0.2248 -0.1081 -0.0449 -0.0824 -0.0735 -0.1311 -0.1376 0.2247 0.2602 0.1064 0.0843 0.0942 0.0925 0.0879 0.0897 0.0835 0.0996 0.0939 0.1275 0.1206 0.0868 0.0845 0.0778 0.0889 0.0825 0.0842 0.0911 0.0940 0.0932 0.0960 0.0756 0.0787 0.0742 0.0795
va: 2.1331 2.1191 2.1959 2.2084 3.0664 3.7389 3.8351 3.8151 3.8944 3.9076 3.9062 4.2353 3.7313 3.9158 3.9419 3.9402 3.6417 3.5920 3.9291 3.9147 3.8960 3.9004 4.2654 4.2615 1.0238 1.0319 1.0155 1.0054 1.0066 1.0002 1.0050 1.0052 1.0089 1.0135 0.9939 0.9986 0.9991 1.0097 1.0020 1.0231 1.0008 1.0185 1.0082 1.0199 1.0083 1.0093 1.0114 1.0082 1.0115
dispcorr: -0.025451796 hartree
energy: -1094.876724794005
dipole: -17.24219 17.51007 0.26788 -7.50259 7.60952 0.10692 -14.89248 14.04143 -0.85105
magnitude: 0.89860 au
magnitude: 2.28406 debye
