program: Orca
programVersion: 5.0.2
elementType: O O O O N C C C C C C C C C C C C C C C C C C C H H H H H H H H H H H H H H H H H H H H H H H H H
charge: 0
multiplicity: 1
keywords: wb97x-d3
keywords: def2-TZVPP
keywords: def2/J RIJCOSX
keywords: DEFGRID2
keywords: scfconv7
keywords: smallprint printgap noloewdin
keywords: NOSOSCF
formula: C19H25NO4
InChI: InChI=1/C19H25NO4/c1-11(2)9-14-15(19(14,3)4)18(23)24-10-20-16(21)12-7-5-6-8-13(12)17(20)22/h9,14-15H,5-8,10H2,1-4H3
49 atoms
O  -0.498965 1.197054 0.809664
O  -1.747853 2.782909 1.758109
O  1.806074 1.757478 -1.499664
O  2.264199 -0.011328 2.667378
N  1.787588 1.150679 0.727841
C  -3.118396 0.847712 -0.86895
C  -2.767176 -0.342444 -0.022091
C  -2.842991 1.018197 0.615496
C  -2.130424 1.341525 -1.898157
C  -4.554293 1.030965 -1.294763
C  -3.769717 -1.378241 0.340584
C  -1.670091 1.764162 1.12501
C  -4.07099 -2.438668 -0.410252
C  0.674239 1.915866 1.166932
C  -5.070918 -3.460115 0.039569
C  -3.43903 -2.704298 -1.742779
C  3.287141 0.052282 -0.629704
C  3.419035 -0.467497 0.590534
C  4.072454 -0.355976 -1.821608
C  4.38824 -1.526776 0.966866
C  4.793038 -1.674283 -1.531409
C  5.431414 -1.681622 -0.14184
C  2.224134 1.091767 -0.593421
C  2.449444 0.197745 1.501966
H  -1.758839 -0.717105 -0.170856
H  -3.72627 1.228399 1.209754
H  -2.321296 0.85243 -2.855647
H  -2.238153 2.416309 -2.05637
H  -1.092999 1.148546 -1.636131
H  -4.762292 0.449075 -2.195106
H  -5.261476 0.709492 -0.531459
H  -4.75588 2.079335 -1.520892
H  -4.274559 -1.261413 1.295325
H  0.737244 2.049012 2.246694
H  0.685168 2.89265 0.682836
H  -4.613826 -4.449905 0.116776
H  -5.499761 -3.21402 1.010123
H  -5.890376 -3.551397 -0.677755
H  -2.763394 -1.91087 -2.056797
H  -2.874571 -3.640369 -1.725723
H  -4.202001 -2.818162 -2.516786
H  3.420712 -0.444997 -2.693527
H  4.790402 0.43262 -2.069316
H  4.859598 -1.288382 1.922802
H  3.851071 -2.466833 1.1296
H  4.077404 -2.498356 -1.604147
H  5.551994 -1.856011 -2.293696
H  6.153055 -0.86252 -0.072756
H  5.994945 -2.603757 0.007334
totalener: -1094.85311448 hartree
nucrepener: 2095.17416613 hartree
electener: -3190.02728060 hartree
oneelecener: -5651.89530877 hartree
twoeener: 2461.86802816 hartree
kineticenergy: 1090.09117229 hartree
xcener: -105.969003312628 hartree
chargesum: 0.0000000
charge: -0.267390 -0.358901 -0.321870 -0.313455 -0.120835 0.085644 0.012607 -0.099294 -0.262822 -0.245675 -0.214845 0.323158 -0.021812 0.075734 -0.211720 -0.239269 -0.073100 -0.092053 -0.075837 -0.074878 -0.134580 -0.135330 0.246929 0.262220 0.099570 0.082480 0.080844 0.097047 0.089714 0.083971 0.081516 0.097437 0.091185 0.126920 0.127471 0.085173 0.080485 0.084189 0.079823 0.094945 0.085855 0.094330 0.093187 0.095210 0.093964 0.075482 0.080309 0.076080 0.080189
qa: -0.2674 -0.3589 -0.3219 -0.3135 -0.1208 0.0856 0.0126 -0.0993 -0.2628 -0.2457 -0.2148 0.3232 -0.0218 0.0757 -0.2117 -0.2393 -0.0731 -0.0921 -0.0758 -0.0749 -0.1346 -0.1353 0.2469 0.2622 0.0996 0.0825 0.0808 0.0970 0.0897 0.0840 0.0815 0.0974 0.0912 0.1269 0.1275 0.0852 0.0805 0.0842 0.0798 0.0949 0.0859 0.0943 0.0932 0.0952 0.0940 0.0755 0.0803 0.0761 0.0802
va: 2.0861 2.1449 2.1863 2.2006 3.1155 3.7098 3.7809 3.9036 3.9172 3.9109 3.8640 4.2697 3.7346 3.9068 3.9409 3.9404 3.6263 3.6335 3.9261 3.9244 3.8974 3.8968 4.2680 4.2711 1.0204 1.0319 1.0034 1.0042 1.0152 1.0027 1.0076 1.0050 1.0144 1.0067 1.0000 0.9977 1.0108 0.9988 1.0109 1.0013 1.0007 1.0192 1.0080 1.0191 1.0085 1.0088 1.0117 1.0087 1.0119
dispcorr: -0.023826710 hartree
energy: -1094.876941188706
dipole: -15.30520 16.27746 0.97225 -18.53275 17.02356 -1.50919 -15.75892 14.62982 -1.12910
magnitude: 2.12080 au
magnitude: 5.39065 debye
