program: Orca
programVersion: 5.0.2
elementType: O O O O N C C C C C C C C C C C C C C C C C C C H H H H H H H H H H H H H H H H H H H H H H H H H
charge: 0
multiplicity: 1
keywords: wb97x-d3
keywords: def2-TZVPP
keywords: def2/J RIJCOSX
keywords: DEFGRID2
keywords: scfconv7
keywords: smallprint printgap noloewdin
keywords: NOSOSCF
formula: C19H25NO4
InChI: InChI=1/C19H25NO4/c1-11(2)9-14-15(19(14,3)4)18(23)24-10-20-16(21)12-7-5-6-8-13(12)17(20)22/h9,14-15H,5-8,10H2,1-4H3
49 atoms
O  -0.535137 1.226619 0.760768
O  -1.746389 2.765797 1.826763
O  1.938348 1.98782 -1.378956
O  2.062307 -0.32262 2.537733
N  1.7521 1.097027 0.741658
C  -3.123176 1.018097 -0.965861
C  -2.859346 -0.210572 -0.14066
C  -2.88272 1.144956 0.526308
C  -2.079051 1.465728 -1.960565
C  -4.530065 1.304254 -1.4348
C  -3.918562 -1.190789 0.176817
C  -1.691818 1.803381 1.108628
C  -3.898365 -2.499319 -0.085489
C  0.653094 1.859687 1.217676
C  -5.047656 -3.38055 0.30375
C  -2.770719 -3.213501 -0.767853
C  3.312663 0.132375 -0.648655
C  3.345438 -0.545786 0.49843
C  4.180924 -0.13524 -1.822739
C  4.242368 -1.692767 0.787254
C  5.338325 -1.044976 -1.404683
C  4.863782 -2.196264 -0.517146
C  2.274692 1.193208 -0.545959
C  2.335118 0.031109 1.425785
H  -1.867454 -0.626706 -0.27317
H  -3.771124 1.382794 1.101719
H  -1.063865 1.198252 -1.678146
H  -2.279922 1.007843 -2.930969
H  -2.110382 2.548368 -2.097892
H  -5.287643 1.023679 -0.704803
H  -4.65299 2.368299 -1.643414
H  -4.744168 0.756397 -2.35422
H  -4.798796 -0.79644 0.67659
H  0.682856 1.888608 2.30666
H  0.71832 2.876034 0.828629
H  -5.474417 -3.880553 -0.569587
H  -4.724012 -4.170047 0.987072
H  -5.845625 -2.823191 0.793038
H  -1.95925 -2.556879 -1.072853
H  -2.351383 -3.982941 -0.11452
H  -3.129129 -3.728371 -1.662517
H  3.58578 -0.60317 -2.613697
H  4.548549 0.802193 -2.245774
H  5.019698 -1.375401 1.489982
H  3.691609 -2.486834 1.296229
H  5.840742 -1.435322 -2.290916
H  6.081644 -0.4537 -0.862006
H  5.695503 -2.866304 -0.294953
H  4.124395 -2.790695 -1.061723
totalener: -1094.85397929 hartree
nucrepener: 2093.01797534 hartree
electener: -3187.87195463 hartree
oneelecener: -5647.51793446 hartree
twoeener: 2459.64597984 hartree
kineticenergy: 1090.08944766 hartree
xcener: -105.969778442607 hartree
chargesum: -0.0000000
charge: -0.270043 -0.360080 -0.319606 -0.312738 -0.118925 0.093055 0.079473 -0.107170 -0.249966 -0.241901 -0.209461 0.328387 -0.040279 0.076555 -0.207576 -0.238885 -0.079057 -0.090212 -0.075528 -0.073550 -0.134505 -0.135604 0.248272 0.257861 0.079739 0.075246 0.083078 0.083048 0.093403 0.071121 0.094418 0.088396 0.074260 0.126168 0.127098 0.082954 0.084924 0.077736 0.077236 0.088954 0.084873 0.093233 0.094518 0.092557 0.095578 0.080460 0.076447 0.080409 0.075627
qa: -0.2700 -0.3601 -0.3196 -0.3127 -0.1189 0.0931 0.0795 -0.1072 -0.2500 -0.2419 -0.2095 0.3284 -0.0403 0.0766 -0.2076 -0.2389 -0.0791 -0.0902 -0.0755 -0.0735 -0.1345 -0.1356 0.2483 0.2579 0.0797 0.0752 0.0831 0.0830 0.0934 0.0711 0.0944 0.0884 0.0743 0.1262 0.1271 0.0830 0.0849 0.0777 0.0772 0.0890 0.0849 0.0932 0.0945 0.0926 0.0956 0.0805 0.0764 0.0804 0.0756
va: 2.0890 2.1443 2.1881 2.2008 3.1151 3.7298 3.7269 3.9050 3.9224 3.9174 3.9107 4.2522 3.8033 3.9082 3.9386 3.9496 3.6262 3.6338 3.9277 3.9244 3.8972 3.8987 4.2683 4.2699 1.0306 1.0368 1.0167 1.0027 1.0040 1.0112 1.0038 1.0049 1.0199 1.0056 1.0012 0.9982 0.9978 1.0121 1.0142 0.9985 1.0000 1.0084 1.0188 1.0084 1.0188 1.0119 1.0089 1.0117 1.0087
dispcorr: -0.022921559 hartree
energy: -1094.876900850611
dipole: -13.93085 14.96002 1.02917 -18.40339 16.95965 -1.44375 -14.30091 13.16879 -1.13211
magnitude: 2.10364 au
magnitude: 5.34702 debye
