program: Orca
programVersion: 5.0.2
elementType: O O O O N C C C C C C C C C C C C C C C C C C C H H H H H H H H H H H H H H H H H H H H H H H H H
charge: 0
multiplicity: 1
keywords: wb97x-d3
keywords: def2-TZVPP
keywords: def2/J RIJCOSX
keywords: DEFGRID2
keywords: scfconv7
keywords: smallprint printgap noloewdin
keywords: NOSOSCF
formula: C19H25NO4
InChI: InChI=1/C19H25NO4/c1-11(2)9-14-15(19(14,3)4)18(23)24-10-20-16(21)12-7-5-6-8-13(12)17(20)22/h9,14-15H,5-8,10H2,1-4H3
49 atoms
O  -0.367698 0.814304 0.028415
O  -1.850512 2.2168 -0.872189
O  2.081984 -0.359832 -2.026509
O  2.34415 1.884086 1.923678
N  1.909769 0.991999 -0.162146
C  -3.825794 0.689262 1.053771
C  -3.995214 0.217875 -0.349133
C  -2.60674 0.245716 0.258869
C  -4.051308 2.148184 1.365732
C  -4.221705 -0.22963 2.185273
C  -4.64431 -1.077828 -0.675352
C  -1.6146 1.207834 -0.258891
C  -4.310042 -1.869019 -1.695595
C  0.682354 1.641818 -0.456919
C  -5.03667 -3.152937 -1.958194
C  -3.202041 -1.55356 -2.653171
C  3.658812 -0.50315 -0.197199
C  3.735616 0.153068 0.960345
C  4.611759 -1.545637 -0.653197
C  4.776589 -0.062653 1.996516
C  5.86943 -1.501111 0.217163
C  5.530698 -1.361282 1.701893
C  2.47807 -0.005642 -0.951964
C  2.610856 1.124536 1.035293
H  -4.16191 1.015021 -1.070034
H  -2.191614 -0.711012 0.554175
H  -3.795931 2.802447 0.536052
H  -5.103779 2.311116 1.605432
H  -3.464962 2.458543 2.232641
H  -5.286107 -0.129169 2.407908
H  -4.027884 -1.278238 1.960088
H  -3.67025 0.021926 3.092495
H  -5.472769 -1.380043 -0.040799
H  0.66452 2.614797 0.034129
H  0.596567 1.781763 -1.534413
H  -5.492457 -3.151235 -2.951353
H  -4.349971 -4.002918 -1.933155
H  -5.824008 -3.336026 -1.228044
H  -2.42218 -2.318526 -2.611452
H  -3.573882 -1.5466 -3.680841
H  -2.734276 -0.589774 -2.46537
H  4.130553 -2.527121 -0.591559
H  4.85524 -1.402601 -1.708233
H  5.461579 0.791422 2.00372
H  4.323913 -0.08566 2.99023
H  6.465775 -2.399396 0.051307
H  6.490079 -0.655294 -0.092586
H  6.442052 -1.402666 2.300077
H  4.916789 -2.211426 2.013277
totalener: -1094.85625224 hartree
nucrepener: 2058.48990227 hartree
electener: -3153.34615451 hartree
oneelecener: -5578.79337436 hartree
twoeener: 2425.44721984 hartree
kineticenergy: 1090.09524845 hartree
xcener: -105.970615177943 hartree
chargesum: 0.0000000
charge: -0.261251 -0.389385 -0.317696 -0.316885 -0.128961 0.127852 -0.022211 -0.097703 -0.257225 -0.273896 -0.237106 0.326442 -0.004370 0.093907 -0.211030 -0.223919 -0.089181 -0.088882 -0.075430 -0.073910 -0.135006 -0.136311 0.266113 0.261619 0.105381 0.083198 0.101325 0.083456 0.087778 0.090328 0.083857 0.092850 0.092893 0.124288 0.121596 0.086706 0.084427 0.078128 0.088958 0.088243 0.084352 0.092808 0.094350 0.092744 0.094748 0.080322 0.075494 0.080612 0.075580
qa: -0.2613 -0.3894 -0.3177 -0.3169 -0.1290 0.1279 -0.0222 -0.0977 -0.2572 -0.2739 -0.2371 0.3264 -0.0044 0.0939 -0.2110 -0.2239 -0.0892 -0.0889 -0.0754 -0.0739 -0.1350 -0.1363 0.2661 0.2616 0.1054 0.0832 0.1013 0.0835 0.0878 0.0903 0.0839 0.0929 0.0929 0.1243 0.1216 0.0867 0.0844 0.0781 0.0890 0.0882 0.0844 0.0928 0.0944 0.0927 0.0947 0.0803 0.0755 0.0806 0.0756
va: 2.1105 2.1076 2.1974 2.1980 3.1179 3.7431 3.8289 3.8398 3.9006 3.9119 3.8946 4.1906 3.7327 3.8990 3.9417 3.9436 3.6205 3.6296 3.9273 3.9256 3.8966 3.8995 4.2750 4.2774 1.0262 1.0309 1.0201 1.0019 1.0019 1.0011 1.0047 1.0064 1.0094 1.0038 1.0039 0.9990 0.9990 1.0095 1.0012 1.0017 1.0178 1.0084 1.0189 1.0081 1.0190 1.0117 1.0087 1.0115 1.0088
dispcorr: -0.022412549 hartree
energy: -1094.878664792702
dipole: -16.26033 17.28713 1.02680 -14.73961 13.48839 -1.25122 2.05622 -1.55058 0.50564
magnitude: 1.69574 au
magnitude: 4.31024 debye
