program: Orca
programVersion: 5.0.2
elementType: O O O O N C C C C C C C C C C C C C C C C C C C H H H H H H H H H H H H H H H H H H H H H H H H H
charge: 0
multiplicity: 1
keywords: wb97x-d3
keywords: def2-TZVPP
keywords: def2/J RIJCOSX
keywords: DEFGRID2
keywords: scfconv7
keywords: smallprint printgap noloewdin
keywords: NOSOSCF
formula: C19H25NO4
InChI: InChI=1/C19H25NO4/c1-11(2)9-14-15(19(14,3)4)18(23)24-10-20-16(21)12-7-5-6-8-13(12)17(20)22/h9,14-15H,5-8,10H2,1-4H3
49 atoms
O  -0.583558 2.032427 1.061329
O  -0.106587 -0.107722 1.513352
O  2.841898 0.672943 2.375055
O  1.130688 2.4759 -1.439909
N  1.747336 1.81204 0.683391
C  -2.356749 -0.326946 -0.742206
C  -2.770717 -0.926506 0.57181
C  -2.216781 0.467784 0.54555
C  -1.129991 -0.856455 -1.445057
C  -3.432118 0.139686 -1.691189
C  -4.195495 -1.154503 0.922442
C  -0.872231 0.72404 1.106046
C  -4.874703 -2.269526 0.650898
C  0.717502 2.448989 1.438732
C  -6.302728 -2.438475 1.071535
C  -4.27766 -3.436354 -0.075073
C  3.292445 0.228795 0.043308
C  2.809985 0.773425 -1.072723
C  4.315088 -0.844953 0.096313
C  3.226706 0.409614 -2.449736
C  4.462153 -1.47531 -1.289997
C  4.512903 -0.41722 -2.392606
C  2.636717 0.870953 1.212658
C  1.794198 1.79535 -0.706641
H  -2.074554 -1.660711 0.968378
H  -2.91441 1.292712 0.649573
H  -1.412966 -1.661157 -2.12679
H  -0.658061 -0.07203 -2.041431
H  -0.384703 -1.254712 -0.759015
H  -3.046057 0.908726 -2.362276
H  -3.786985 -0.69257 -2.302454
H  -4.29725 0.549481 -1.171736
H  -4.706625 -0.356221 1.452911
H  0.912934 2.251691 2.49397
H  0.718985 3.522104 1.261705
H  -6.945977 -2.636104 0.210376
H  -6.415136 -3.291194 1.745952
H  -6.685982 -1.556065 1.582465
H  -3.257154 -3.252958 -0.405682
H  -4.270719 -4.327361 0.558041
H  -4.872526 -3.689008 -0.956376
H  5.267526 -0.424527 0.435347
H  4.03829 -1.592295 0.843042
H  2.422269 -0.156098 -2.931602
H  3.361113 1.307413 -3.057373
H  5.359592 -2.094848 -1.321681
H  3.615899 -2.144289 -1.471012
H  4.690767 -0.890426 -3.359452
H  5.360994 0.250072 -2.213256
totalener: -1094.85100240 hartree
nucrepener: 2148.85708363 hartree
electener: -3243.70808603 hartree
oneelecener: -5759.77706661 hartree
twoeener: 2516.06898057 hartree
kineticenergy: 1090.10547521 hartree
xcener: -105.973905833816 hartree
chargesum: -0.0000000
charge: -0.255288 -0.375675 -0.307366 -0.315216 -0.123181 0.123724 -0.026337 -0.097344 -0.299989 -0.249215 -0.195122 0.328360 -0.027430 0.090087 -0.211718 -0.234332 -0.034888 -0.109590 -0.077588 -0.065056 -0.133489 -0.138954 0.254043 0.225778 0.107094 0.078452 0.089879 0.095468 0.094858 0.101161 0.085969 0.080424 0.088870 0.127450 0.119922 0.083080 0.086720 0.078979 0.079581 0.095323 0.084329 0.090843 0.096537 0.088610 0.093764 0.078670 0.076055 0.078898 0.074850
qa: -0.2553 -0.3757 -0.3074 -0.3152 -0.1232 0.1237 -0.0263 -0.0973 -0.3000 -0.2492 -0.1951 0.3284 -0.0274 0.0901 -0.2117 -0.2343 -0.0349 -0.1096 -0.0776 -0.0651 -0.1335 -0.1390 0.2540 0.2258 0.1071 0.0785 0.0899 0.0955 0.0949 0.1012 0.0860 0.0804 0.0889 0.1275 0.1199 0.0831 0.0867 0.0790 0.0796 0.0953 0.0843 0.0908 0.0965 0.0886 0.0938 0.0787 0.0761 0.0789 0.0748
va: 2.1319 2.1284 2.2069 2.1929 3.0739 3.7125 3.8148 3.8746 3.8980 3.9028 3.8612 4.2802 3.7409 3.9173 3.9407 3.9395 3.5945 3.6601 3.9186 3.9219 3.8985 3.9052 4.2636 4.2622 1.0256 1.0340 1.0052 1.0090 1.0161 1.0043 1.0029 1.0075 1.0139 1.0134 0.9931 0.9989 0.9976 1.0107 1.0111 1.0012 1.0004 1.0074 1.0191 1.0094 1.0194 1.0114 1.0092 1.0115 1.0082
dispcorr: -0.025659446 hartree
energy: -1094.876661844397
dipole: -18.74840 18.83063 0.08223 -20.89771 20.35023 -0.54748 -13.39787 12.43399 -0.96388
magnitude: 1.11156 au
magnitude: 2.82536 debye
