program: Orca
programVersion: 5.0.2
elementType: O O O O N C C C C C C C C C C C C C C C C C C C H H H H H H H H H H H H H H H H H H H H H H H H H
charge: 0
multiplicity: 1
keywords: wb97x-d3
keywords: def2-TZVPP
keywords: def2/J RIJCOSX
keywords: DEFGRID2
keywords: scfconv7
keywords: smallprint printgap noloewdin
keywords: NOSOSCF
formula: C19H25NO4
InChI: InChI=1/C19H25NO4/c1-11(2)9-14-15(19(14,3)4)18(23)24-10-20-16(21)12-7-5-6-8-13(12)17(20)22/h9,14-15H,5-8,10H2,1-4H3
49 atoms
O  -0.006001 -0.821922 -0.056737
O  -1.373515 -1.60799 -1.644398
O  2.059969 0.97247 -1.941787
O  3.024704 -1.849819 1.493827
N  2.269788 -0.693816 -0.358356
C  -3.02399 0.918696 -0.693183
C  -3.680129 -0.36288 -0.269566
C  -2.219735 -0.137493 0.042662
C  -2.803049 1.157609 -2.166763
C  -3.304307 2.18913 0.073163
C  -4.664984 -0.426434 0.825797
C  -1.197132 -0.940248 -0.660591
C  -5.864351 -1.011234 0.78873
C  1.108583 -1.446428 -0.679581
C  -6.765382 -0.986863 1.987518
C  -6.432036 -1.72397 -0.40076
C  3.81138 1.011887 -0.272383
C  4.09667 0.182461 0.731118
C  4.56132 2.249827 -0.598718
C  5.232562 0.34446 1.672694
C  5.483382 2.609458 0.567534
C  6.210274 1.381084 1.115854
C  2.621812 0.493251 -0.997278
C  3.104003 -0.9267 0.73299
H  -3.837605 -1.060799 -1.084397
H  -1.966275 0.111819 1.067513
H  -3.666788 1.677071 -2.585722
H  -1.926059 1.786285 -2.333258
H  -2.665937 0.237807 -2.730226
H  -4.22706 2.651641 -0.280759
H  -3.409828 2.027316 1.144837
H  -2.494498 2.905903 -0.071986
H  -4.376733 0.056298 1.755239
H  0.979996 -1.478439 -1.760523
H  1.228592 -2.460774 -0.298966
H  -7.713132 -0.494035 1.755919
H  -7.013621 -1.999523 2.315152
H  -6.314295 -0.464316 2.830237
H  -6.673732 -2.759941 -0.150314
H  -7.367372 -1.256027 -0.717683
H  -5.766963 -1.739262 -1.260974
H  5.137707 2.093542 -1.516428
H  3.86852 3.064337 -0.821866
H  4.851816 0.655033 2.651022
H  5.726956 -0.615095 1.839666
H  6.205429 3.362794 0.249306
H  4.8911 3.064789 1.366489
H  6.91747 1.676944 1.89193
H  6.800446 0.924038 0.31614
totalener: -1094.85633480 hartree
nucrepener: 2038.22883599 hartree
electener: -3133.08517080 hartree
oneelecener: -5538.26259531 hartree
twoeener: 2405.17742451 hartree
kineticenergy: 1090.10677442 hartree
xcener: -105.973880596670 hartree
chargesum: 0.0000000
charge: -0.263829 -0.384979 -0.319466 -0.317484 -0.118788 0.083717 0.042049 -0.088613 -0.257702 -0.246038 -0.186598 0.343041 -0.049064 0.080444 -0.204468 -0.235719 -0.077412 -0.098232 -0.073526 -0.075537 -0.135086 -0.135069 0.256092 0.267882 0.089293 0.071531 0.084646 0.093825 0.097042 0.092044 0.070058 0.092571 0.071309 0.128485 0.119726 0.083416 0.084689 0.075488 0.086244 0.084318 0.083887 0.092528 0.094562 0.093442 0.093888 0.079560 0.075768 0.080460 0.075605
qa: -0.2638 -0.3850 -0.3195 -0.3175 -0.1188 0.0837 0.0420 -0.0886 -0.2577 -0.2460 -0.1866 0.3430 -0.0491 0.0804 -0.2045 -0.2357 -0.0774 -0.0982 -0.0735 -0.0755 -0.1351 -0.1351 0.2561 0.2679 0.0893 0.0715 0.0846 0.0938 0.0970 0.0920 0.0701 0.0926 0.0713 0.1285 0.1197 0.0834 0.0847 0.0755 0.0862 0.0843 0.0839 0.0925 0.0946 0.0934 0.0939 0.0796 0.0758 0.0805 0.0756
va: 2.1156 2.1176 2.1910 2.1964 3.1030 3.7555 3.7792 3.8930 3.9133 3.9131 3.9023 4.2241 3.8214 3.8908 3.9354 3.9455 3.6221 3.6472 3.9262 3.9257 3.8985 3.8963 4.2791 4.2781 1.0375 1.0363 1.0005 1.0035 1.0217 1.0044 1.0108 1.0042 1.0208 1.0112 1.0054 0.9980 0.9983 1.0124 0.9991 0.9992 1.0156 1.0084 1.0188 1.0087 1.0192 1.0118 1.0087 1.0117 1.0089
dispcorr: -0.021769208 hartree
energy: -1094.878104012952
dipole: -22.99026 23.82367 0.83340 10.86328 -9.73905 1.12423 4.32311 -3.67356 0.64955
magnitude: 1.54285 au
magnitude: 3.92161 debye
