program: Orca
programVersion: 5.0.2
elementType: O O O O N C C C C C C C C C C C C C C C C C C C H H H H H H H H H H H H H H H H H H H H H H H H H
charge: 0
multiplicity: 1
keywords: wb97x-d3
keywords: def2-TZVPP
keywords: def2/J RIJCOSX
keywords: DEFGRID2
keywords: scfconv7
keywords: smallprint printgap noloewdin
keywords: NOSOSCF
formula: C19H25NO4
InChI: InChI=1/C19H25NO4/c1-11(2)9-14-15(19(14,3)4)18(23)24-10-20-16(21)12-7-5-6-8-13(12)17(20)22/h9,14-15H,5-8,10H2,1-4H3
49 atoms
O  0.28361 -1.171479 -0.086395
O  1.410347 -1.123689 1.855842
O  -1.42397 0.806819 1.627919
O  -3.097197 -2.202943 -1.33287
N  -1.99722 -0.961576 0.272285
C  2.769416 1.340036 0.421499
C  3.697745 0.176337 0.471951
C  2.293488 -0.021795 -0.073374
C  2.237933 1.913505 1.712017
C  2.944479 2.38256 -0.655334
C  4.86991 0.042562 -0.4281
C  1.319632 -0.811955 0.691854
C  5.554063 -1.088361 -0.621745
C  -0.85287 -1.781516 0.510135
C  6.749169 -1.13297 -1.523429
C  5.195861 -2.389881 0.026145
C  -3.4016 0.864219 0.226002
C  -3.892879 -0.024998 -0.638365
C  -4.012234 2.180102 0.534321
C  -5.125599 0.155415 -1.441601
C  -5.448991 2.207148 0.010679
C  -5.554641 1.622926 -1.39723
C  -2.166709 0.301502 0.8224
C  -2.997995 -1.208044 -0.65983
H  3.832198 -0.242839 1.465246
H  2.196203 -0.101172 -1.149936
H  1.231926 2.315696 1.578044
H  2.879063 2.736575 2.033454
H  2.209664 1.191551 2.524861
H  3.700041 3.113103 -0.359923
H  2.009509 2.921843 -0.815682
H  3.245643 1.956221 -1.611613
H  5.199803 0.937207 -0.947824
H  -0.712057 -1.927961 1.578376
H  -1.013427 -2.749351 0.040721
H  6.978444 -0.157214 -1.951239
H  6.591881 -1.835066 -2.346189
H  7.633888 -1.482985 -0.985364
H  5.996841 -2.72475 0.690495
H  5.077395 -3.172369 -0.72739
H  4.275724 -2.345041 0.606548
H  -3.983848 2.372039 1.608998
H  -3.415427 2.97099 0.069611
H  -4.962099 -0.173221 -2.470271
H  -5.911914 -0.490782 -1.039253
H  -6.088572 1.635508 0.689144
H  -5.820598 3.232453 0.019604
H  -4.923969 2.202016 -2.077717
H  -6.577528 1.714224 -1.764472
elementType: O N C H
totalener: -1094.86827358 hartree
nucrepener: 2079.35635117 hartree
electener: -3174.22462475 hartree
oneelecener: -5621.21692311 hartree
twoeener: 2446.99229835 hartree
cpcmener: -0.03706388 hartree
kineticenergy: 1090.04334764 hartree
xcener: -105.974783258513 hartree
chargesum: -0.0000000
charge: -0.287757 -0.485989 -0.442100 -0.434068 -0.092453 0.161467 -0.045676 -0.083342 -0.279022 -0.292994 -0.278885 0.403187 -0.014695 0.079809 -0.230421 -0.248449 -0.058602 -0.080171 -0.073140 -0.070152 -0.134312 -0.136330 0.340202 0.342151 0.101461 0.094819 0.094283 0.100368 0.094565 0.102098 0.099617 0.090967 0.127573 0.142937 0.125623 0.089701 0.095643 0.094949 0.100751 0.095713 0.079996 0.092989 0.102844 0.093836 0.102095 0.078492 0.080984 0.078277 0.081162
qa: -0.2878 -0.4860 -0.4421 -0.4341 -0.0925 0.1615 -0.0457 -0.0833 -0.2790 -0.2930 -0.2789 0.4032 -0.0147 0.0798 -0.2304 -0.2484 -0.0586 -0.0802 -0.0731 -0.0702 -0.1343 -0.1363 0.3402 0.3422 0.1015 0.0948 0.0943 0.1004 0.0946 0.1021 0.0996 0.0910 0.1276 0.1429 0.1256 0.0897 0.0956 0.0949 0.1008 0.0957 0.0800 0.0930 0.1028 0.0938 0.1021 0.0785 0.0810 0.0783 0.0812
va: 2.1048 2.0121 2.0652 2.0786 3.1025 3.7158 3.8425 3.8127 3.8768 3.9155 3.8825 4.1323 3.7071 3.8577 3.9281 3.9432 3.6741 3.7139 3.9185 3.9156 3.9155 3.9182 4.1860 4.1985 1.0231 1.0326 1.0074 1.0023 1.0156 0.9984 1.0022 1.0012 1.0023 1.0150 1.0164 1.0068 0.9961 0.9956 0.9982 0.9984 1.0158 1.0157 1.0044 1.0154 1.0045 1.0066 1.0093 1.0064 1.0092
dispcorr: -0.023073989 hartree
energy: -1094.891347571345
dipole: 18.60955 -19.73863 -1.12908 11.36816 -10.12251 1.24565 -5.49705 4.25336 -1.24369
magnitude: 2.09123 au
magnitude: 5.31548 debye
