program: Orca
programVersion: 5.0.2
elementType: O O O O N C C C C C C C C C C C C C C C C C C C H H H H H H H H H H H H H H H H H H H H H H H H H
charge: 0
multiplicity: 1
keywords: wb97x-d3
keywords: def2-TZVPP
keywords: def2/J RIJCOSX
keywords: DEFGRID2
keywords: scfconv7
keywords: smallprint printgap noloewdin
keywords: NOSOSCF
formula: C19H25NO4
InChI: InChI=1/C19H25NO4/c1-11(2)9-14-15(19(14,3)4)18(23)24-10-20-16(21)12-7-5-6-8-13(12)17(20)22/h9,14-15H,5-8,10H2,1-4H3
49 atoms
O  0.144294 -0.962547 -0.963731
O  1.22538 -2.188754 0.575456
O  -1.610554 -0.530567 1.645451
O  -3.128984 -0.711027 -2.631483
N  -2.139424 -0.940279 -0.55832
C  2.652961 0.594459 1.00525
C  3.575394 -0.376957 0.331865
C  2.189235 -0.155882 -0.235751
C  2.102633 0.239205 2.364499
C  2.874516 2.076801 0.831324
C  4.747807 0.056417 -0.455238
C  1.173616 -1.216126 -0.138769
C  5.998264 -0.402281 -0.336531
C  -1.025731 -1.767879 -0.891165
C  7.094507 0.129762 -1.210067
C  6.438339 -1.447847 0.641738
C  -3.472475 0.573202 0.555791
C  -3.925923 0.507259 -0.696986
C  -4.043134 1.423715 1.627644
C  -5.097944 1.250082 -1.22017
C  -4.997536 2.448064 1.010951
C  -5.901052 1.820513 -0.049857
C  -2.306376 -0.333294 0.67967
C  -3.063848 -0.426767 -1.461876
H  3.688545 -1.313572 0.86729
H  2.122393 0.452596 -1.131042
H  1.101836 0.652811 2.504392
H  2.744574 0.66691 3.13682
H  2.054025 -0.832503 2.543652
H  1.955431 2.62597 1.043134
H  3.192302 2.343966 -0.17536
H  3.637834 2.430558 1.527179
H  4.563095 0.823693 -1.201615
H  -0.918775 -2.564154 -0.158649
H  -1.198788 -2.211301 -1.868982
H  7.896664 0.566569 -0.60948
H  6.737839 0.892147 -1.902309
H  7.551348 -0.67169 -1.796481
H  6.904756 -2.288291 0.121659
H  5.6333 -1.84289 1.257756
H  7.199573 -1.043675 1.313831
H  -4.56671 0.79005 2.35022
H  -3.244195 1.919118 2.184021
H  -4.751902 2.051342 -1.880742
H  -5.717641 0.596315 -1.83802
H  -5.602184 2.901916 1.796734
H  -4.414484 3.25475 0.558102
H  -6.611103 2.559939 -0.421485
H  -6.490104 1.019625 0.405073
elementType: O N C H
totalener: -1094.86993449 hartree
nucrepener: 2066.83859917 hartree
electener: -3161.70853366 hartree
oneelecener: -5596.09312006 hartree
twoeener: 2434.38458640 hartree
cpcmener: -0.03833555 hartree
kineticenergy: 1090.03340157 hartree
xcener: -105.973233572390 hartree
chargesum: -0.0000000
charge: -0.284785 -0.479330 -0.440705 -0.434179 -0.096106 0.114116 0.038436 -0.106260 -0.282706 -0.266913 -0.285388 0.408876 -0.048852 0.081368 -0.219691 -0.251521 -0.053714 -0.082926 -0.070997 -0.072036 -0.136452 -0.135229 0.334536 0.347182 0.092982 0.093722 0.093702 0.100271 0.094334 0.098115 0.089392 0.097844 0.122385 0.141466 0.126634 0.093856 0.088693 0.094420 0.095687 0.090505 0.096860 0.101626 0.094019 0.102654 0.093470 0.081579 0.079171 0.080783 0.079107
qa: -0.2848 -0.4793 -0.4407 -0.4342 -0.0961 0.1141 0.0384 -0.1063 -0.2827 -0.2669 -0.2854 0.4089 -0.0489 0.0814 -0.2197 -0.2515 -0.0537 -0.0829 -0.0710 -0.0720 -0.1365 -0.1352 0.3345 0.3472 0.0930 0.0937 0.0937 0.1003 0.0943 0.0981 0.0894 0.0978 0.1224 0.1415 0.1266 0.0939 0.0887 0.0944 0.0957 0.0905 0.0969 0.1016 0.0940 0.1027 0.0935 0.0816 0.0792 0.0808 0.0791
va: 2.1091 2.0254 2.0662 2.0776 3.1056 3.6814 3.7751 3.8412 3.8985 3.9074 3.8677 4.1576 3.7575 3.8588 3.9204 3.9412 3.6751 3.7147 3.9170 3.9185 3.9161 3.9156 4.1853 4.1932 1.0322 1.0358 1.0070 1.0019 1.0165 1.0020 1.0055 1.0018 1.0095 1.0159 1.0149 0.9961 1.0087 0.9960 0.9968 1.0097 0.9971 1.0048 1.0152 1.0048 1.0154 1.0091 1.0065 1.0095 1.0064
dispcorr: -0.022619303 hartree
energy: -1094.892553797229
dipole: 21.95599 -22.95553 -0.99953 13.53923 -11.62970 1.90953 7.56229 -7.52180 0.04048
magnitude: 2.15569 au
magnitude: 5.47933 debye
