program: Orca
programVersion: 5.0.2
elementType: O O O O N C C C C C C C C C C C C C C C C C C C H H H H H H H H H H H H H H H H H H H H H H H H H
charge: 0
multiplicity: 1
keywords: wb97x-d3
keywords: def2-TZVPP
keywords: def2/J RIJCOSX
keywords: DEFGRID2
keywords: scfconv7
keywords: smallprint printgap noloewdin
keywords: NOSOSCF
formula: C19H25NO4
InChI: InChI=1/C19H25NO4/c1-11(2)9-14-15(19(14,3)4)18(23)24-10-20-16(21)12-7-5-6-8-13(12)17(20)22/h9,14-15H,5-8,10H2,1-4H3
49 atoms
O  0.530646 1.723226 -1.46825
O  0.404438 -0.510475 -1.474544
O  -1.467587 2.673965 0.592496
O  -2.508291 -0.468421 -2.524328
N  -1.788651 1.317304 -1.243325
C  2.246375 0.249496 1.0737
C  2.919797 -0.666918 0.087976
C  2.247918 0.587249 -0.408291
C  0.975431 -0.216832 1.739622
C  3.082372 1.136867 1.960775
C  4.387737 -0.795772 -0.003439
C  0.991552 0.500944 -1.172299
C  5.050859 -1.955992 0.004471
C  -0.749359 1.839293 -2.076724
C  6.545185 -1.995279 -0.083588
C  4.361536 -3.290808 0.111938
C  -2.934832 0.751947 0.675578
C  -3.23164 -0.173466 -0.237454
C  -3.472031 0.795061 2.056056
C  -4.142815 -1.322497 -0.020358
C  -4.667281 -0.152958 2.165799
C  -4.399504 -1.490545 1.478347
C  -1.988179 1.71794 0.072484
C  -2.495649 0.141282 -1.485166
H  2.366497 -1.580238 -0.10754
H  2.8869 1.42068 -0.681488
H  1.216623 -0.728153 2.67334
H  0.398585 -0.911838 1.131512
H  0.332339 0.630142 1.989413
H  3.40512 0.589861 2.848945
H  2.500291 1.996884 2.296915
H  3.972768 1.517085 1.462116
H  4.957954 0.125222 -0.080021
H  -0.785889 1.334282 -3.041257
H  -0.884618 2.905813 -2.235058
H  6.981675 -0.998791 -0.150458
H  6.871916 -2.567159 -0.95612
H  6.974977 -2.495745 0.788201
H  5.072277 -4.110838 0.014395
H  3.602458 -3.426777 -0.660471
H  3.860339 -3.412364 1.074309
H  -2.681058 0.506193 2.755775
H  -3.754756 1.815279 2.324204
H  -5.080292 -1.144328 -0.556444
H  -3.717711 -2.232527 -0.449005
H  -4.910272 -0.313524 3.216924
H  -5.541994 0.319408 1.709748
H  -5.242933 -2.165109 1.629782
H  -3.529642 -1.966561 1.939593
elementType: O N C H
totalener: -1094.86749077 hartree
nucrepener: 2147.48455144 hartree
electener: -3242.35204221 hartree
oneelecener: -5757.56765558 hartree
twoeener: 2515.21561337 hartree
cpcmener: -0.03963332 hartree
kineticenergy: 1090.05019583 hartree
xcener: -105.975893549094 hartree
chargesum: -0.0000000
charge: -0.277366 -0.474478 -0.434290 -0.427853 -0.103374 0.126344 0.031644 -0.117354 -0.279413 -0.274524 -0.309033 0.404489 -0.019236 0.084415 -0.220202 -0.283206 -0.098652 -0.022610 -0.064211 -0.072273 -0.137175 -0.134857 0.324533 0.311350 0.093135 0.099889 0.105992 0.091207 0.090781 0.098496 0.099293 0.089929 0.122620 0.136158 0.145491 0.085327 0.096079 0.098377 0.096013 0.101557 0.107496 0.101589 0.094375 0.101088 0.093316 0.081056 0.078149 0.080949 0.078970
qa: -0.2774 -0.4745 -0.4343 -0.4279 -0.1034 0.1263 0.0316 -0.1174 -0.2794 -0.2745 -0.3090 0.4045 -0.0192 0.0844 -0.2202 -0.2832 -0.0987 -0.0226 -0.0642 -0.0723 -0.1372 -0.1349 0.3245 0.3114 0.0931 0.0999 0.1060 0.0912 0.0908 0.0985 0.0993 0.0899 0.1226 0.1362 0.1455 0.0853 0.0961 0.0984 0.0960 0.1016 0.1075 0.1016 0.0944 0.1011 0.0933 0.0811 0.0781 0.0809 0.0790
va: 2.1137 2.0305 2.0657 2.0805 3.0807 3.6983 3.7903 3.8344 3.9009 3.9039 3.8749 4.2046 3.7021 3.8886 3.9176 3.9376 3.7146 3.6175 3.9125 3.9100 3.9206 3.9152 4.1569 4.1931 1.0263 1.0319 1.0018 1.0139 1.0092 1.0013 1.0022 1.0051 1.0078 1.0134 0.9922 1.0099 0.9933 0.9928 1.0042 0.9987 0.9944 1.0062 1.0161 1.0039 1.0158 1.0093 1.0062 1.0094 1.0072
dispcorr: -0.025151415 hartree
energy: -1094.892642188347
dipole: 17.84759 -18.25925 -0.41166 -14.33956 14.24503 -0.09453 18.04080 -16.45576 1.58504
magnitude: 1.64035 au
magnitude: 4.16944 debye
